Fedora-Fr - Communauté francophone Fedora - Linux

Communauté francophone des utilisateurs de la distribution Linux Fedora.

  

Dernière news : Rétrospective de l'adoption du nouveau logo de Fedora

#1 15/11/2019 08:38:48

fedora23
Membre
Inscription : 21/06/2016
Messages : 87

Problème suite à l'installation du pilote proprio fourni par RPMFusion

Bonjour,

suite à l'installation du pilote propriétaire fourni par RPMFusion, au démarrage (tout de suite après le chargement du logo fedora) j'ai cette erreur :

"Oh mince ! Quelque chose s'est mal passé .
Un problème est survenu et le système ne peut pas se récupérer.
Déconnectez-vous et essayez à nouveau."

Deconnexion (bouton à cliquer)

Jai l'impression que je n'arrive pas à installer correctement ce pilote ?

merci d'avance

Dernière modification par fedora23 (15/11/2019 08:40:43)


Dell Alienware m11x R2, core i5 - NVIDIA Corporation GT215M [GeForce GT 335M] (rev a2)
Dual boot Windows 10 / Linux Fedora 34  - x86_64 x86_64 x86_64

Hors ligne

#2 15/11/2019 08:44:55

madko
Contributeur Fedora et Linuxé depuis 1994
Modérateur
Lieu : Noisy the Great (9³)
Inscription : 22/12/2006
Messages : 8 472
Site Web

Re : Problème suite à l'installation du pilote proprio fourni par RPMFusion

Bonjour,

quelle documentation as tu suivi ? Qu'as tu installé exactement ?


Linux, ya moins bien, mais c'est plus chèr!!!
Fedora 32 WorkStation sur HP 850 G5
Fedora 32 SilverBlue sur Lenovo Thinkpad Yoga 12

Hors ligne

#3 15/11/2019 09:55:49

fedora23
Membre
Inscription : 21/06/2016
Messages : 87

Re : Problème suite à l'installation du pilote proprio fourni par RPMFusion

madko a écrit :

Bonjour,

quelle documentation as tu suivi ? Qu'as tu installé exactement ?


voici la doc (partie 3.2 Installation)

les 2 dernières commandes que j'ai tapées sont

dnf install akmod-nvidia-340*

et

dnf install libva-vdpau-driver libva-utils

Dell Alienware m11x R2, core i5 - NVIDIA Corporation GT215M [GeForce GT 335M] (rev a2)
Dual boot Windows 10 / Linux Fedora 34  - x86_64 x86_64 x86_64

Hors ligne

#4 15/11/2019 20:11:21

Nicosss
Rédacteur Wiki
Rédacteur Wiki
Lieu : Isère
Inscription : 05/03/2007
Messages : 6 493
Site Web

Re : Problème suite à l'installation du pilote proprio fourni par RPMFusion

Parce que tu dois avoir le souci avec Wayland enfin Nvidia surtout, voir la suite de la doc 3.6.4 https://doc.fedora-fr.org/wiki/Carte_gr … et_Wayland.


F34_64 Gnome-Shell - GA-990FXA-UD3 - Phenom II X6 1100T - NH-D14 - Ati HD 5750 Fanless - 16Go RAM /&/ F33_64 Gnome-Shell - Toshiba Satellite C660D-19X - 8Go RAM
F33_64 - ASRock 960GC-GS FX - AMD FX(tm)-8300 - 16Go RAM

Hors ligne

#5 16/11/2019 01:20:24

fedora23
Membre
Inscription : 21/06/2016
Messages : 87

Re : Problème suite à l'installation du pilote proprio fourni par RPMFusion

Nicosss a écrit :

Parce que tu dois avoir le souci avec Wayland enfin Nvidia surtout, voir la suite de la doc 3.6.4 https://doc.fedora-fr.org/wiki/Carte_gr … et_Wayland.

J'ai vérifié, Waylandenable=false est bien décommenté  donc le problème doit être ailleurs :

$ cat /etc/gdm/custom.conf
# GDM configuration storage

[daemon]
# Uncomment the line below to force the login screen to use Xorg
WaylandEnable=false
DefaultSession=gnome-xorg.desktop

[security]

[xdmcp]

[chooser]

[debug]
# Uncomment the line below to turn on debugging
#Enable=true

Dell Alienware m11x R2, core i5 - NVIDIA Corporation GT215M [GeForce GT 335M] (rev a2)
Dual boot Windows 10 / Linux Fedora 34  - x86_64 x86_64 x86_64

Hors ligne

#6 16/11/2019 06:58:10

Nicosss
Rédacteur Wiki
Rédacteur Wiki
Lieu : Isère
Inscription : 05/03/2007
Messages : 6 493
Site Web

Re : Problème suite à l'installation du pilote proprio fourni par RPMFusion

Que retourne

$ lspci -nnk | grep -iA3 "VGA"
$ lsmod

F34_64 Gnome-Shell - GA-990FXA-UD3 - Phenom II X6 1100T - NH-D14 - Ati HD 5750 Fanless - 16Go RAM /&/ F33_64 Gnome-Shell - Toshiba Satellite C660D-19X - 8Go RAM
F33_64 - ASRock 960GC-GS FX - AMD FX(tm)-8300 - 16Go RAM

Hors ligne

#7 16/11/2019 16:21:55

fedora23
Membre
Inscription : 21/06/2016
Messages : 87

Re : Problème suite à l'installation du pilote proprio fourni par RPMFusion

Nicosss a écrit :

Que retourne

$ lspci -nnk | grep -iA3 "VGA"
$ lsmod
$ lspci -nnk | grep -iA3 "VGA"
00:02.0 VGA compatible controller [0300]: Intel Corporation Core Processor Integrated Graphics Controller [8086:0046] (rev 02)
	Subsystem: Dell Device [1028:0465]
	Kernel driver in use: i915
	Kernel modules: i915
--
01:00.0 VGA compatible controller [0300]: NVIDIA Corporation GT215M [GeForce GT 335M] [10de:0caf] (rev a2)
	Subsystem: Dell Device [1028:0465]
	Kernel modules: nouveau
01:00.1 Audio device [0403]: NVIDIA Corporation High Definition Audio Controller [10de:0be4] (rev a1)
$ lsmod
Module                  Size  Used by
ccm                    20480  3
xt_CHECKSUM            16384  1
xt_MASQUERADE          20480  3
tun                    57344  1
bridge                208896  0
stp                    16384  1 bridge
llc                    16384  2 bridge,stp
nf_conntrack_netbios_ns    16384  1
nf_conntrack_broadcast    16384  1 nf_conntrack_netbios_ns
xt_CT                  16384  1
ip6t_rpfilter          16384  1
ip6t_REJECT            16384  2
nf_reject_ipv6         20480  1 ip6t_REJECT
ipt_REJECT             16384  4
nf_reject_ipv4         16384  1 ipt_REJECT
xt_conntrack           16384  22
ebtable_nat            16384  1
ebtable_broute         16384  1
ip6table_nat           16384  1
ip6table_mangle        16384  1
ip6table_raw           16384  1
ip6table_security      16384  1
iptable_nat            16384  1
nf_nat                 49152  3 ip6table_nat,iptable_nat,xt_MASQUERADE
iptable_mangle         16384  1
iptable_raw            16384  1
iptable_security       16384  1
nf_conntrack          159744  6 xt_conntrack,nf_nat,nf_conntrack_netbios_ns,nf_conntrack_broadcast,xt_CT,xt_MASQUERADE
nf_defrag_ipv6         24576  1 nf_conntrack
nf_defrag_ipv4         16384  1 nf_conntrack
libcrc32c              16384  2 nf_conntrack,nf_nat
ip_set                 53248  0
nfnetlink              16384  1 ip_set
ebtable_filter         16384  1
ebtables               40960  3 ebtable_nat,ebtable_filter,ebtable_broute
ip6table_filter        16384  1
ip6_tables             32768  7 ip6table_filter,ip6table_raw,ip6table_nat,ip6table_mangle,ip6table_security
iptable_filter         16384  1
ip_tables              32768  5 iptable_filter,iptable_security,iptable_raw,iptable_nat,iptable_mangle
sunrpc                462848  1
brcmsmac              585728  0
brcmutil               16384  1 brcmsmac
b43                   454656  0
cordic                 16384  2 b43,brcmsmac
mac80211              974848  2 b43,brcmsmac
intel_powerclamp       20480  0
snd_hda_codec_hdmi     65536  4
coretemp               20480  0
cfg80211              835584  3 b43,mac80211,brcmsmac
snd_hda_codec_realtek   126976  1
kvm_intel             299008  0
snd_hda_codec_generic    94208  1 snd_hda_codec_realtek
ledtrig_audio          16384  2 snd_hda_codec_generic,snd_hda_codec_realtek
snd_hda_intel          53248  10
snd_hda_codec         159744  4 snd_hda_codec_generic,snd_hda_codec_hdmi,snd_hda_intel,snd_hda_codec_realtek
ssb                    98304  1 b43
uvcvideo              114688  0
kvm                   770048  1 kvm_intel
videobuf2_vmalloc      20480  1 uvcvideo
videobuf2_memops       20480  1 videobuf2_vmalloc
snd_hda_core          102400  5 snd_hda_codec_generic,snd_hda_codec_hdmi,snd_hda_intel,snd_hda_codec,snd_hda_codec_realtek
videobuf2_v4l2         28672  1 uvcvideo
rfkill                 28672  3 cfg80211
videobuf2_common       57344  2 videobuf2_v4l2,uvcvideo
libarc4                16384  1 mac80211
irqbypass              16384  1 kvm
snd_hwdep              16384  1 snd_hda_codec
videodev              237568  3 videobuf2_v4l2,uvcvideo,videobuf2_common
mc                     61440  4 videodev,videobuf2_v4l2,uvcvideo,videobuf2_common
snd_seq                86016  0
crct10dif_pclmul       16384  1
crc32_pclmul           16384  0
iTCO_wdt               16384  0
snd_seq_device         16384  1 snd_seq
iTCO_vendor_support    16384  1 iTCO_wdt
snd_pcm               118784  4 snd_hda_codec_hdmi,snd_hda_intel,snd_hda_codec,snd_hda_core
snd_timer              40960  2 snd_seq,snd_pcm
ghash_clmulni_intel    16384  0
intel_cstate           20480  0
intel_uncore          147456  0
snd                    98304  30 snd_hda_codec_generic,snd_seq,snd_seq_device,snd_hda_codec_hdmi,snd_hwdep,snd_hda_intel,snd_hda_codec,snd_hda_codec_realtek,snd_timer,snd_pcm
soundcore              16384  1 snd
dell_wmi               20480  0
sparse_keymap          16384  1 dell_wmi
jmb38x_ms              24576  0
memstick               20480  1 jmb38x_ms
joydev                 28672  0
lpc_ich                28672  0
dell_smbios            32768  1 dell_wmi
bcma                   65536  3 b43,brcmsmac
i2c_i801               32768  0
dcdbas                 20480  1 dell_smbios
dell_wmi_descriptor    20480  2 dell_wmi,dell_smbios
intel_ips              28672  0
wmi_bmof               16384  0
dell_smo8800           20480  0
acpi_cpufreq           28672  1
i915                 2318336  7
sdhci_pci              49152  0
i2c_algo_bit           16384  1 i915
cqhci                  32768  1 sdhci_pci
drm_kms_helper        212992  1 i915
sdhci                  65536  1 sdhci_pci
crc32c_intel           24576  7
drm                   512000  4 drm_kms_helper,i915
firewire_ohci          49152  0
serio_raw              20480  0
mmc_core              180224  5 b43,sdhci,ssb,cqhci,sdhci_pci
firewire_core          81920  1 firewire_ohci
atl1c                  57344  0
crc_itu_t              16384  1 firewire_core
mxm_wmi                16384  0
wmi                    36864  5 dell_wmi,wmi_bmof,dell_smbios,dell_wmi_descriptor,mxm_wmi
video                  49152  2 dell_wmi,i915
fuse                  139264  1

Dell Alienware m11x R2, core i5 - NVIDIA Corporation GT215M [GeForce GT 335M] (rev a2)
Dual boot Windows 10 / Linux Fedora 34  - x86_64 x86_64 x86_64

Hors ligne

#8 16/11/2019 16:44:05

Nicosss
Rédacteur Wiki
Rédacteur Wiki
Lieu : Isère
Inscription : 05/03/2007
Messages : 6 493
Site Web

Re : Problème suite à l'installation du pilote proprio fourni par RPMFusion

Le pilote nvidia n'est pas vu et pas chargé, et nouveau est vu mais pas chargé aussi.
Mais au pire tu devrais avoir l'affichage sur la carte Intel.

A voir avec les experts de la technologie Optimus, j'ai abandonné Nvidia il y a bien longtemps. Voir en cas https://doc.fedora-fr.org/wiki/Prime.


F34_64 Gnome-Shell - GA-990FXA-UD3 - Phenom II X6 1100T - NH-D14 - Ati HD 5750 Fanless - 16Go RAM /&/ F33_64 Gnome-Shell - Toshiba Satellite C660D-19X - 8Go RAM
F33_64 - ASRock 960GC-GS FX - AMD FX(tm)-8300 - 16Go RAM

Hors ligne

#9 16/11/2019 18:49:31

fedora23
Membre
Inscription : 21/06/2016
Messages : 87

Re : Problème suite à l'installation du pilote proprio fourni par RPMFusion

Nicosss a écrit :

Le pilote nvidia n'est pas vu et pas chargé, et nouveau est vu mais pas chargé aussi.
Mais au pire tu devrais avoir l'affichage sur la carte Intel.

A voir avec les experts de la technologie Optimus, j'ai abandonné Nvidia il y a bien longtemps. Voir en cas https://doc.fedora-fr.org/wiki/Prime.

Effectivement, l'avis d'un expert de la technologie Optimus serait le bienvenu.

En attendant, toujours selon la doc (partie 3.6.1 - Informations Générales) que je cite :

"Lorsqu'un problème persiste et n'est pas répertorié, vous pouvez faire quelques vérifications :

    Le pilote est bien compilé (lancer akmods en administrateur) ;
... ....
"

mais je rencontre des ERREURS sans comprendre comment y remédier :

# akmods
Checking kmods exist for 5.3.11-200.fc30.x86_64            [  OK  ]
Building and installing nvidia-340xx-kmod                  [ÉCHOUÉ]
Building rpms failed; see /var/cache/akmods/nvidia-340xx/340.107-8-for-5.3.11-200.fc30.x86_64.failed.log for details

Hint: Some kmods were ignored or failed to build or install.
You can try to rebuild and install them by by calling
'/usr/sbin/akmods --force' as root.

et voici les erreurs dans la log :

# cat /var/cache/akmods/nvidia-340xx/340.107-8-for-5.3.11-200.fc30.x86_64.failed.log
2019/11/16 17:44:17 akmods: Building RPM using the command '/sbin/akmodsbuild --kernels 5.3.11-200.fc30.x86_64 /usr/src/akmods/nvidia-340xx-kmod.latest'
      |                     ^~~~~~~~~~~
/tmp/akmodsbuild.BDZemvCW/BUILD/nvidia-340xx-kmod-340.107/_kmod_build_5.3.11-200.fc30.x86_64/nv-linux.h:919:11: note: in expansion of macro 'NV_ON_EACH_CPU'
  919 |     ret = NV_ON_EACH_CPU(func, info, 1);
      |           ^~~~~~~~~~~~~~
make[2]: *** [scripts/Makefile.build:281: /tmp/akmodsbuild.BDZemvCW/BUILD/nvidia-340xx-kmod-340.107/_kmod_build_5.3.11-200.fc30.x86_64/nv-cray.o] Error 1
In file included from /tmp/akmodsbuild.BDZemvCW/BUILD/nvidia-340xx-kmod-340.107/_kmod_build_5.3.11-200.fc30.x86_64/nv-acpi.c:15:
/tmp/akmodsbuild.BDZemvCW/BUILD/nvidia-340xx-kmod-340.107/_kmod_build_5.3.11-200.fc30.x86_64/nv-linux.h: In function 'nv_execute_on_all_cpus':
/tmp/akmodsbuild.BDZemvCW/BUILD/nvidia-340xx-kmod-340.107/_kmod_build_5.3.11-200.fc30.x86_64/nv-linux.h:903:21: error: void value not ignored as it ought to be
  903 |         int __ret = on_each_cpu(func, info, wait);     \
      |                     ^~~~~~~~~~~
/tmp/akmodsbuild.BDZemvCW/BUILD/nvidia-340xx-kmod-340.107/_kmod_build_5.3.11-200.fc30.x86_64/nv-linux.h:919:11: note: in expansion of macro 'NV_ON_EACH_CPU'
  919 |     ret = NV_ON_EACH_CPU(func, info, 1);
      |           ^~~~~~~~~~~~~~
make[2]: *** [scripts/Makefile.build:281: /tmp/akmodsbuild.BDZemvCW/BUILD/nvidia-340xx-kmod-340.107/_kmod_build_5.3.11-200.fc30.x86_64/nv-dma.o] Error 1
make[2]: *** [scripts/Makefile.build:281: /tmp/akmodsbuild.BDZemvCW/BUILD/nvidia-340xx-kmod-340.107/_kmod_build_5.3.11-200.fc30.x86_64/nv-acpi.o] Error 1
make[1]: *** [Makefile:1630: _module_/tmp/akmodsbuild.BDZemvCW/BUILD/nvidia-340xx-kmod-340.107/_kmod_build_5.3.11-200.fc30.x86_64] Error 2
make[1]: Leaving directory '/usr/src/kernels/5.3.11-200.fc30.x86_64'
NVIDIA: left KBUILD.
nvidia.ko failed to build!
make: *** [Makefile:194: nvidia.ko] Error 1
erreur : Mauvais statut de sortie pour /var/tmp/rpm-tmp.gU4ArL (%build)


Erreur de construction de RPM :
    user mockbuild does not exist - using root
    group mock does not exist - using root
    user mockbuild does not exist - using root
    group mock does not exist - using root
    user mockbuild does not exist - using root
    group mock does not exist - using root
    user mockbuild does not exist - using root
    group mock does not exist - using root
    user mockbuild does not exist - using root
    group mock does not exist - using root
    Mauvais statut de sortie pour /var/tmp/rpm-tmp.gU4ArL (%build)
2019/11/16 17:44:57 akmodsbuild: * Rebuilding /usr/src/akmods/nvidia-340xx-kmod.latest for kernel(s) 5.3.11-200.fc30.x86_64: attention : user mockbuild does not exist - using root
2019/11/16 17:44:57 akmodsbuild: attention : group mock does not exist - using root
2019/11/16 17:44:57 akmodsbuild: attention : user mockbuild does not exist - using root
2019/11/16 17:44:57 akmodsbuild: attention : group mock does not exist - using root
2019/11/16 17:44:57 akmodsbuild: attention : user mockbuild does not exist - using root
2019/11/16 17:44:57 akmodsbuild: attention : group mock does not exist - using root
2019/11/16 17:44:57 akmodsbuild: attention : user mockbuild does not exist - using root
2019/11/16 17:44:57 akmodsbuild: attention : group mock does not exist - using root
2019/11/16 17:44:57 akmodsbuild: attention : user mockbuild does not exist - using root
2019/11/16 17:44:57 akmodsbuild: attention : group mock does not exist - using root
2019/11/16 17:44:57 akmodsbuild: Installation de /usr/src/akmods/nvidia-340xx-kmod.latest
2019/11/16 17:44:57 akmodsbuild: Construction pour plate-formes cibles: x86_64
2019/11/16 17:44:57 akmodsbuild: Construction pour cible x86_64
2019/11/16 17:44:57 akmodsbuild: Exécution_de(%prep) : /bin/sh -e /var/tmp/rpm-tmp.AsbsJc
2019/11/16 17:44:57 akmodsbuild: + umask 022
2019/11/16 17:44:57 akmodsbuild: + cd /tmp/akmodsbuild.BDZemvCW//BUILD
2019/11/16 17:44:57 akmodsbuild: + kmodtool --target x86_64 --repo rpmfusion --kmodname nvidia-340xx-kmod --filterfile /tmp/akmodsbuild.BDZemvCW/SOURCES/nvidia-kmodtool-excludekernel-filterfile --obsolete-name nvidia --obsolete-version 1:340.1000 --akmod --for-kernels 5.3.11-200.fc30.x86_64
2019/11/16 17:44:57 akmodsbuild: %global  _prefix_usr      /usr
2019/11/16 17:44:57 akmodsbuild: 
2019/11/16 17:44:57 akmodsbuild: %if 0%{?rhel}
2019/11/16 17:44:57 akmodsbuild: %package       -n kmod-nvidia-340xx-5.3.11-200.fc30.x86_64
2019/11/16 17:44:57 akmodsbuild: Summary:          nvidia-340xx kernel module(s) for 5.3.11-200.fc30
2019/11/16 17:44:57 akmodsbuild: Provides:         kernel-modules = 5.3.11-200.fc30.x86_64
2019/11/16 17:44:57 akmodsbuild: Provides:         nvidia-340xx-kmod = %{?epoch:%{epoch}:}%{version}-%{release}
2019/11/16 17:44:57 akmodsbuild: Requires:         nvidia-340xx-kmod-common >= %{?epoch:%{epoch}:}%{version}
2019/11/16 17:44:57 akmodsbuild: Requires(post):   %{?_prefix_usr}/sbin/weak-modules
2019/11/16 17:44:57 akmodsbuild: Requires(post):   %{?_prefix_usr}/sbin/depmod
2019/11/16 17:44:57 akmodsbuild: Requires(postun): %{?_prefix_usr}/sbin/weak-modules
2019/11/16 17:44:57 akmodsbuild: Requires(postun): %{?_prefix_usr}/sbin/depmod
2019/11/16 17:44:57 akmodsbuild: %else
2019/11/16 17:44:57 akmodsbuild: %package       -n kmod-nvidia-340xx-5.3.11-200.fc30.x86_64
2019/11/16 17:44:57 akmodsbuild: Summary:          nvidia-340xx kernel module(s) for 5.3.11-200.fc30.x86_64
2019/11/16 17:44:57 akmodsbuild: Provides:         kernel-modules-for-kernel = 5.3.11-200.fc30.x86_64
2019/11/16 17:44:57 akmodsbuild: Provides:         nvidia-340xx-kmod = %{?epoch:%{epoch}:}%{version}-%{release}
2019/11/16 17:44:57 akmodsbuild: Requires:         nvidia-340xx-kmod-common >= %{?epoch:%{epoch}:}%{version}
2019/11/16 17:44:57 akmodsbuild: Requires(post):   %{?_prefix_usr}/sbin/depmod
2019/11/16 17:44:57 akmodsbuild: Requires(postun): %{?_prefix_usr}/sbin/depmod
2019/11/16 17:44:57 akmodsbuild: %endif
2019/11/16 17:44:57 akmodsbuild: 
2019/11/16 17:44:57 akmodsbuild: Provides:         kmod-nvidia-5.3.11-200.fc30.x86_64 = 1:340.1000
2019/11/16 17:44:57 akmodsbuild: Obsoletes:        kmod-nvidia-5.3.11-200.fc30.x86_64 < 1:340.1000
2019/11/16 17:44:57 akmodsbuild: %global _kmodtool_depmod_post if [ -f /boot/System.map-5.3.11-200.fc30.x86_64 ] ; then   %{?_prefix_usr}/sbin/depmod -aeF /boot/System.map-5.3.11-200.fc30.x86_64 5.3.11-200.fc30.x86_64 >/dev/null ; elif [ -f /lib/modules/5.3.11-200.fc30.x86_64/System.map ] ; then   %{?_prefix_usr}/sbin/depmod -aeF /lib/modules/5.3.11-200.fc30.x86_64/System.map 5.3.11-200.fc30.x86_64 >/dev/null ; else   %{?_prefix_usr}/sbin/depmod -a >/dev/null ; fi || :
2019/11/16 17:44:57 akmodsbuild: 
2019/11/16 17:44:57 akmodsbuild: %if 0%{?rhel}
2019/11/16 17:44:57 akmodsbuild: Requires:         kernel >= 5.3.11-200.fc30
2019/11/16 17:44:57 akmodsbuild: Requires:         kernel < 5.3.11-201.fc30
2019/11/16 17:44:57 akmodsbuild: BuildRequires:    kernel-devel = 5.3.11-200.fc30 redhat-rpm-config kernel-abi-whitelists
2019/11/16 17:44:57 akmodsbuild: 
2019/11/16 17:44:57 akmodsbuild: %post          -n kmod-nvidia-340xx-5.3.11-200.fc30.x86_64
2019/11/16 17:44:57 akmodsbuild: %{_kmodtool_depmod_post}
2019/11/16 17:44:57 akmodsbuild: 
2019/11/16 17:44:57 akmodsbuild: modules=( $(find /usr/lib/modules/5.3.11-200.fc30.x86_64/extra/nvidia-340xx/ | grep -e '.ko$') )
2019/11/16 17:44:57 akmodsbuild: printf '%sn' "${modules[@]}" | %{?_prefix_usr}/sbin/weak-modules --add-modules
2019/11/16 17:44:57 akmodsbuild: 
2019/11/16 17:44:57 akmodsbuild: %preun         -n kmod-nvidia-340xx-5.3.11-200.fc30.x86_64
2019/11/16 17:44:57 akmodsbuild: rpm -ql kmod-nvidia-340xx-5.3.11-200.fc30.x86_64-%{version}-%{release}.x86_64 | grep -e '.ko$' > /var/run/rpm-kmod-nvidia-340xx-modules
2019/11/16 17:44:57 akmodsbuild: 
2019/11/16 17:44:57 akmodsbuild: %postun        -n kmod-nvidia-340xx-5.3.11-200.fc30.x86_64
2019/11/16 17:44:57 akmodsbuild: %{_kmodtool_depmod_post}
2019/11/16 17:44:57 akmodsbuild: 
2019/11/16 17:44:57 akmodsbuild: modules=( $(cat /var/run/rpm-kmod-nvidia-340xx-modules) )
2019/11/16 17:44:57 akmodsbuild: rm /var/run/rpm-kmod-nvidia-340xx-modules
2019/11/16 17:44:57 akmodsbuild: printf '%sn' "${modules[@]}" | %{?_prefix_usr}/sbin/weak-modules --remove-modules
2019/11/16 17:44:57 akmodsbuild: %else
2019/11/16 17:44:57 akmodsbuild: Requires:         kernel-uname-r = 5.3.11-200.fc30.x86_64
2019/11/16 17:44:57 akmodsbuild: BuildRequires:    kernel-devel-uname-r = 5.3.11-200.fc30.x86_64
2019/11/16 17:44:57 akmodsbuild: BuildRequires:    gcc
2019/11/16 17:44:57 akmodsbuild: %post          -n kmod-nvidia-340xx-5.3.11-200.fc30.x86_64
2019/11/16 17:44:57 akmodsbuild: %{_kmodtool_depmod_post}
2019/11/16 17:44:57 akmodsbuild: %postun        -n kmod-nvidia-340xx-5.3.11-200.fc30.x86_64
2019/11/16 17:44:57 akmodsbuild: %{_kmodtool_depmod_post}
2019/11/16 17:44:57 akmodsbuild: %endif
2019/11/16 17:44:57 akmodsbuild: 
2019/11/16 17:44:57 akmodsbuild: %if 0%{?rhel}
2019/11/16 17:44:57 akmodsbuild: %description   -n kmod-nvidia-340xx-5.3.11-200.fc30.x86_64
2019/11/16 17:44:57 akmodsbuild: This package provides the nvidia-340xx kernel modules built for the Linux
2019/11/16 17:44:57 akmodsbuild: kernel 5.3.11-200.fc30 for the %{_target_cpu} family of processors.
2019/11/16 17:44:57 akmodsbuild: %files         -n kmod-nvidia-340xx-5.3.11-200.fc30.x86_64
2019/11/16 17:44:57 akmodsbuild: %defattr(644,root,root,755)
2019/11/16 17:44:57 akmodsbuild: %dir /usr/lib/modules/5.3.11-200.fc30.x86_64/extra
2019/11/16 17:44:57 akmodsbuild: /usr/lib/modules/5.3.11-200.fc30.x86_64/extra/nvidia-340xx/
2019/11/16 17:44:57 akmodsbuild: %else
2019/11/16 17:44:57 akmodsbuild: %description   -n kmod-nvidia-340xx-5.3.11-200.fc30.x86_64
2019/11/16 17:44:57 akmodsbuild: This package provides the nvidia-340xx kernel modules built for the Linux
2019/11/16 17:44:57 akmodsbuild: kernel 5.3.11-200.fc30.x86_64 for the %{_target_cpu} family of processors.
2019/11/16 17:44:57 akmodsbuild: %files         -n kmod-nvidia-340xx-5.3.11-200.fc30.x86_64
2019/11/16 17:44:57 akmodsbuild: %defattr(644,root,root,755)
2019/11/16 17:44:57 akmodsbuild: %dir /usr/lib/modules/5.3.11-200.fc30.x86_64/extra
2019/11/16 17:44:57 akmodsbuild: /usr/lib/modules/5.3.11-200.fc30.x86_64/extra/nvidia-340xx/
2019/11/16 17:44:57 akmodsbuild: %endif
2019/11/16 17:44:57 akmodsbuild: 
2019/11/16 17:44:57 akmodsbuild: %global kmodinstdir_prefix  /usr/lib/modules/
2019/11/16 17:44:57 akmodsbuild: %global kmodinstdir_postfix /extra/nvidia-340xx/
2019/11/16 17:44:57 akmodsbuild: %global kernel_versions     5.3.11-200.fc30.x86_64___%{_usrsrc}/kernels/5.3.11-200.fc30.x86_64
2019/11/16 17:44:57 akmodsbuild: %global debug_package %{nil}
2019/11/16 17:44:57 akmodsbuild: 
2019/11/16 17:44:57 akmodsbuild: + cd /tmp/akmodsbuild.BDZemvCW/BUILD
2019/11/16 17:44:57 akmodsbuild: + rm -rf nvidia-340xx-kmod-340.107
2019/11/16 17:44:57 akmodsbuild: + /usr/bin/mkdir -p nvidia-340xx-kmod-340.107
2019/11/16 17:44:57 akmodsbuild: + cd nvidia-340xx-kmod-340.107
2019/11/16 17:44:57 akmodsbuild: + /usr/bin/chmod -Rf a+rX,u+w,g-w,o-w .
2019/11/16 17:44:57 akmodsbuild: + tar --use-compress-program xz -xf /usr/share/nvidia-340xx-kmod-340.107/nvidia-340xx-kmod-340.107-x86_64.tar.xz
2019/11/16 17:44:57 akmodsbuild: + echo 'Patch #0 (nv-linux-arm.patch):'
2019/11/16 17:44:57 akmodsbuild: Patch #0 (nv-linux-arm.patch):
2019/11/16 17:44:57 akmodsbuild: + /usr/bin/patch --no-backup-if-mismatch -p1 --fuzz=0
2019/11/16 17:44:57 akmodsbuild: patching file kernel/nv-linux.h
2019/11/16 17:44:57 akmodsbuild: + echo 'Patch #1 (buildfix_kernel_5.0.patch):'
2019/11/16 17:44:57 akmodsbuild: Patch #1 (buildfix_kernel_5.0.patch):
2019/11/16 17:44:57 akmodsbuild: + /usr/bin/patch --no-backup-if-mismatch -p1 --fuzz=0
2019/11/16 17:44:57 akmodsbuild: patching file kernel/Makefile
2019/11/16 17:44:57 akmodsbuild: patching file kernel/conftest.sh
2019/11/16 17:44:57 akmodsbuild: patching file kernel/nv-drm.c
2019/11/16 17:44:57 akmodsbuild: patching file kernel/nv-time.h
2019/11/16 17:44:57 akmodsbuild: patching file kernel/os-interface.c
2019/11/16 17:44:57 akmodsbuild: patching file kernel/uvm/Makefile
2019/11/16 17:44:57 akmodsbuild: patching file kernel/uvm/nvidia_uvm_linux.h
2019/11/16 17:44:57 akmodsbuild: patching file kernel/uvm/nvidia_uvm_lite.c
2019/11/16 17:44:57 akmodsbuild: + echo 'Patch #2 (xf86-video-nvidia-legacy-02-fix-linux-5.1.patch):'
2019/11/16 17:44:57 akmodsbuild: Patch #2 (xf86-video-nvidia-legacy-02-fix-linux-5.1.patch):
2019/11/16 17:44:57 akmodsbuild: + /usr/bin/patch --no-backup-if-mismatch -p1 --fuzz=0
2019/11/16 17:44:57 akmodsbuild: patching file kernel/nv-drm.c
2019/11/16 17:44:57 akmodsbuild: + for kernel_version in 5.3.11-200.fc30.x86_64___/usr/src/kernels/5.3.11-200.fc30.x86_64
2019/11/16 17:44:57 akmodsbuild: + cp -a kernel _kmod_build_5.3.11-200.fc30.x86_64
2019/11/16 17:44:57 akmodsbuild: + exit 0
2019/11/16 17:44:57 akmodsbuild: Exécution_de(%build) : /bin/sh -e /var/tmp/rpm-tmp.gU4ArL
2019/11/16 17:44:57 akmodsbuild: + umask 022
2019/11/16 17:44:57 akmodsbuild: + cd /tmp/akmodsbuild.BDZemvCW//BUILD
2019/11/16 17:44:57 akmodsbuild: + cd nvidia-340xx-kmod-340.107
2019/11/16 17:44:57 akmodsbuild: + for kernel_version in 5.3.11-200.fc30.x86_64___/usr/src/kernels/5.3.11-200.fc30.x86_64
2019/11/16 17:44:57 akmodsbuild: + pushd _kmod_build_5.3.11-200.fc30.x86_64/
2019/11/16 17:44:57 akmodsbuild: /tmp/akmodsbuild.BDZemvCW/BUILD/nvidia-340xx-kmod-340.107/_kmod_build_5.3.11-200.fc30.x86_64 /tmp/akmodsbuild.BDZemvCW/BUILD/nvidia-340xx-kmod-340.107
2019/11/16 17:44:57 akmodsbuild: + make -j4 KERNEL_UNAME=5.3.11-200.fc30.x86_64 SYSSRC=/usr/src/kernels/5.3.11-200.fc30.x86_64 IGNORE_CC_MISMATCH=1 IGNORE_XEN_PRESENCE=1 IGNORE_PREEMPT_RT_PRESENCE=1 module
2019/11/16 17:44:57 akmodsbuild: NVIDIA: calling KBUILD...
2019/11/16 17:44:57 akmodsbuild: make[1]: Entering directory '/usr/src/kernels/5.3.11-200.fc30.x86_64'
2019/11/16 17:44:57 akmodsbuild: Makefile:213: ================= WARNING ================
2019/11/16 17:44:57 akmodsbuild: Makefile:214: 'SUBDIRS' will be removed after Linux 5.3
2019/11/16 17:44:57 akmodsbuild: Makefile:215:
2019/11/16 17:44:57 akmodsbuild: Makefile:216: If you are building an individual subdirectory
2019/11/16 17:44:57 akmodsbuild: Makefile:217: in the kernel tree, you can do like this:
2019/11/16 17:44:57 akmodsbuild: Makefile:218: $ make path/to/dir/you/want/to/build/
2019/11/16 17:44:57 akmodsbuild: Makefile:219: (Do not forget the trailing slash)
2019/11/16 17:44:57 akmodsbuild: Makefile:220:
2019/11/16 17:44:57 akmodsbuild: Makefile:221: If you are building an external module,
2019/11/16 17:44:57 akmodsbuild: Makefile:222: Please use 'M=' or 'KBUILD_EXTMOD' instead
2019/11/16 17:44:57 akmodsbuild: Makefile:223: ==========================================
2019/11/16 17:44:57 akmodsbuild: test -e include/generated/autoconf.h -a -e include/config/auto.conf || (		echo >&2;					echo >&2 "  ERROR: Kernel configuration is invalid.";		echo >&2 "         include/generated/autoconf.h or include/config/auto.conf are missing.";echo >&2 "         Run 'make oldconfig && make prepare' on kernel src to fix it.";	echo >&2 ;							/bin/false)
2019/11/16 17:44:57 akmodsbuild: make -f ./scripts/Makefile.build obj=/tmp/akmodsbuild.BDZemvCW/BUILD/nvidia-340xx-kmod-340.107/_kmod_build_5.3.11-200.fc30.x86_64 need-modorder=1
2019/11/16 17:44:57 akmodsbuild: {   echo /tmp/akmodsbuild.BDZemvCW/BUILD/nvidia-340xx-kmod-340.107/_kmod_build_5.3.11-200.fc30.x86_64/nvidia.ko; :; } | awk '!x[$0]++' - > /tmp/akmodsbuild.BDZemvCW/BUILD/nvidia-340xx-kmod-340.107/_kmod_build_5.3.11-200.fc30.x86_64/modules.order
2019/11/16 17:44:57 akmodsbuild: cc -Wp,-MD,/tmp/akmodsbuild.BDZemvCW/BUILD/nvidia-340xx-kmod-340.107/_kmod_build_5.3.11-200.fc30.x86_64/.nv-acpi.o.d  -nostdinc -isystem /usr/lib/gcc/x86_64-redhat-linux/9/include -I./arch/x86/include -I./arch/x86/include/generated  -I./include -I./arch/x86/include/uapi -I./arch/x86/include/generated/uapi -I./include/uapi -I./include/generated/uapi -include ./include/linux/kconfig.h -include ./include/linux/compiler_types.h -D__KERNEL__ -Wall -Wundef -Werror=strict-prototypes -Wno-trigraphs -fno-strict-aliasing -fno-common -fshort-wchar -fno-PIE -Werror=implicit-function-declaration -Werror=implicit-int -Wno-format-security -Wno-address-of-packed-member -std=gnu89 -mno-sse -mno-mmx -mno-sse2 -mno-3dnow -mno-avx -m64 -falign-jumps=1 -falign-loops=1 -mno-80387 -mno-fp-ret-in-387 -mpreferred-stack-boundary=3 -mskip-rax-setup -mtune=generic -mno-red-zone -mcmodel=kernel -DCONFIG_AS_CFI=1 -DCONFIG_AS_CFI_SIGNAL_FRAME=1 -DCONFIG_AS_CFI_SECTIONS=1 -DCONFIG_AS_SSSE3=1 -DCONFIG_AS_AVX=1 -DCONFIG_AS_AVX2=1 -DCONFIG_AS_AVX512=1 -DCONFIG_AS_SHA1_NI=1 -DCONFIG_AS_SHA256_NI=1 -Wno-sign-compare -fno-asynchronous-unwind-tables -mindirect-branch=thunk-extern -mindirect-branch-register -fno-jump-tables -fno-delete-null-pointer-checks -Wno-frame-address -Wno-format-truncation -Wno-format-overflow -Wno-address-of-packed-member -O2 --param=allow-store-data-races=0 -Wframe-larger-than=2048 -fstack-protector-strong -Wno-unused-but-set-variable -Wimplicit-fallthrough -Wno-unused-const-variable -fvar-tracking-assignments -g -pg -mrecord-mcount -mfentry -DCC_USING_FENTRY -Wdeclaration-after-statement -Wvla -Wno-pointer-sign -Wno-stringop-truncation -fno-strict-overflow -fno-merge-all-constants -fmerge-constants -fno-stack-check -fconserve-stack -Werror=date-time -Werror=incompatible-pointer-types -Werror=designated-init -fmacro-prefix-map=./= -fcf-protection=none -Wno-packed-not-aligned -DNV_MODULE_INSTANCE=0 -DNV_BUILD_MODULE_INSTANCES=0 -UDEBUG -U_DEBUG -DNDEBUG -I/tmp/akmodsbuild.BDZemvCW/BUILD/nvidia-340xx-kmod-340.107/_kmod_build_5.3.11-200.fc30.x86_64 -Wall -MD -Wsign-compare -Wno-cast-qual -Wno-error -D__KERNEL__ -DMODULE -DNVRM -DNV_VERSION_STRING="340.107" -Wno-unused-function -Wuninitialized -fno-strict-aliasing -mno-red-zone -mcmodel=kernel -DNV_UVM_ENABLE -D__linux__ -DNV_DEV_NAME="nvidia"  -DMODULE  -DKBUILD_BASENAME='"nv_acpi"' -DKBUILD_MODNAME='"nvidia"' -c -o /tmp/akmodsbuild.BDZemvCW/BUILD/nvidia-340xx-kmod-340.107/_kmod_build_5.3.11-200.fc30.x86_64/nv-acpi.o /tmp/akmodsbuild.BDZemvCW/BUILD/nvidia-340xx-kmod-340.107/_kmod_build_5.3.11-200.fc30.x86_64/nv-acpi.c
2019/11/16 17:44:57 akmodsbuild: cc -Wp,-MD,/tmp/akmodsbuild.BDZemvCW/BUILD/nvidia-340xx-kmod-340.107/_kmod_build_5.3.11-200.fc30.x86_64/.nv-chrdev.o.d  -nostdinc -isystem /usr/lib/gcc/x86_64-redhat-linux/9/include -I./arch/x86/include -I./arch/x86/include/generated  -I./include -I./arch/x86/include/uapi -I./arch/x86/include/generated/uapi -I./include/uapi -I./include/generated/uapi -include ./include/linux/kconfig.h -include ./include/linux/compiler_types.h -D__KERNEL__ -Wall -Wundef -Werror=strict-prototypes -Wno-trigraphs -fno-strict-aliasing -fno-common -fshort-wchar -fno-PIE -Werror=implicit-function-declaration -Werror=implicit-int -Wno-format-security -Wno-address-of-packed-member -std=gnu89 -mno-sse -mno-mmx -mno-sse2 -mno-3dnow -mno-avx -m64 -falign-jumps=1 -falign-loops=1 -mno-80387 -mno-fp-ret-in-387 -mpreferred-stack-boundary=3 -mskip-rax-setup -mtune=generic -mno-red-zone -mcmodel=kernel -DCONFIG_AS_CFI=1 -DCONFIG_AS_CFI_SIGNAL_FRAME=1 -DCONFIG_AS_CFI_SECTIONS=1 -DCONFIG_AS_SSSE3=1 -DCONFIG_AS_AVX=1 -DCONFIG_AS_AVX2=1 -DCONFIG_AS_AVX512=1 -DCONFIG_AS_SHA1_NI=1 -DCONFIG_AS_SHA256_NI=1 -Wno-sign-compare -fno-asynchronous-unwind-tables -mindirect-branch=thunk-extern -mindirect-branch-register -fno-jump-tables -fno-delete-null-pointer-checks -Wno-frame-address -Wno-format-truncation -Wno-format-overflow -Wno-address-of-packed-member -O2 --param=allow-store-data-races=0 -Wframe-larger-than=2048 -fstack-protector-strong -Wno-unused-but-set-variable -Wimplicit-fallthrough -Wno-unused-const-variable -fvar-tracking-assignments -g -pg -mrecord-mcount -mfentry -DCC_USING_FENTRY -Wdeclaration-after-statement -Wvla -Wno-pointer-sign -Wno-stringop-truncation -fno-strict-overflow -fno-merge-all-constants -fmerge-constants -fno-stack-check -fconserve-stack -Werror=date-time -Werror=incompatible-pointer-types -Werror=designated-init -fmacro-prefix-map=./= -fcf-protection=none -Wno-packed-not-aligned -DNV_MODULE_INSTANCE=0 -DNV_BUILD_MODULE_INSTANCES=0 -UDEBUG -U_DEBUG -DNDEBUG -I/tmp/akmodsbuild.BDZemvCW/BUILD/nvidia-340xx-kmod-340.107/_kmod_build_5.3.11-200.fc30.x86_64 -Wall -MD -Wsign-compare -Wno-cast-qual -Wno-error -D__KERNEL__ -DMODULE -DNVRM -DNV_VERSION_STRING="340.107" -Wno-unused-function -Wuninitialized -fno-strict-aliasing -mno-red-zone -mcmodel=kernel -DNV_UVM_ENABLE -D__linux__ -DNV_DEV_NAME="nvidia"  -DMODULE  -DKBUILD_BASENAME='"nv_chrdev"' -DKBUILD_MODNAME='"nvidia"' -c -o /tmp/akmodsbuild.BDZemvCW/BUILD/nvidia-340xx-kmod-340.107/_kmod_build_5.3.11-200.fc30.x86_64/nv-chrdev.o /tmp/akmodsbuild.BDZemvCW/BUILD/nvidia-340xx-kmod-340.107/_kmod_build_5.3.11-200.fc30.x86_64/nv-chrdev.c
2019/11/16 17:44:57 akmodsbuild: cc -Wp,-MD,/tmp/akmodsbuild.BDZemvCW/BUILD/nvidia-340xx-kmod-340.107/_kmod_build_5.3.11-200.fc30.x86_64/.nv-cray.o.d  -nostdinc -isystem /usr/lib/gcc/x86_64-redhat-linux/9/include -I./arch/x86/include -I./arch/x86/include/generated  -I./include -I./arch/x86/include/uapi -I./arch/x86/include/generated/uapi -I./include/uapi -I./include/generated/uapi -include ./include/linux/kconfig.h -include ./include/linux/compiler_types.h -D__KERNEL__ -Wall -Wundef -Werror=strict-prototypes -Wno-trigraphs -fno-strict-aliasing -fno-common -fshort-wchar -fno-PIE -Werror=implicit-function-declaration -Werror=implicit-int -Wno-format-security -Wno-address-of-packed-member -std=gnu89 -mno-sse -mno-mmx -mno-sse2 -mno-3dnow -mno-avx -m64 -falign-jumps=1 -falign-loops=1 -mno-80387 -mno-fp-ret-in-387 -mpreferred-stack-boundary=3 -mskip-rax-setup -mtune=generic -mno-red-zone -mcmodel=kernel -DCONFIG_AS_CFI=1 -DCONFIG_AS_CFI_SIGNAL_FRAME=1 -DCONFIG_AS_CFI_SECTIONS=1 -DCONFIG_AS_SSSE3=1 -DCONFIG_AS_AVX=1 -DCONFIG_AS_AVX2=1 -DCONFIG_AS_AVX512=1 -DCONFIG_AS_SHA1_NI=1 -DCONFIG_AS_SHA256_NI=1 -Wno-sign-compare -fno-asynchronous-unwind-tables -mindirect-branch=thunk-extern -mindirect-branch-register -fno-jump-tables -fno-delete-null-pointer-checks -Wno-frame-address -Wno-format-truncation -Wno-format-overflow -Wno-address-of-packed-member -O2 --param=allow-store-data-races=0 -Wframe-larger-than=2048 -fstack-protector-strong -Wno-unused-but-set-variable -Wimplicit-fallthrough -Wno-unused-const-variable -fvar-tracking-assignments -g -pg -mrecord-mcount -mfentry -DCC_USING_FENTRY -Wdeclaration-after-statement -Wvla -Wno-pointer-sign -Wno-stringop-truncation -fno-strict-overflow -fno-merge-all-constants -fmerge-constants -fno-stack-check -fconserve-stack -Werror=date-time -Werror=incompatible-pointer-types -Werror=designated-init -fmacro-prefix-map=./= -fcf-protection=none -Wno-packed-not-aligned -DNV_MODULE_INSTANCE=0 -DNV_BUILD_MODULE_INSTANCES=0 -UDEBUG -U_DEBUG -DNDEBUG -I/tmp/akmodsbuild.BDZemvCW/BUILD/nvidia-340xx-kmod-340.107/_kmod_build_5.3.11-200.fc30.x86_64 -Wall -MD -Wsign-compare -Wno-cast-qual -Wno-error -D__KERNEL__ -DMODULE -DNVRM -DNV_VERSION_STRING="340.107" -Wno-unused-function -Wuninitialized -fno-strict-aliasing -mno-red-zone -mcmodel=kernel -DNV_UVM_ENABLE -D__linux__ -DNV_DEV_NAME="nvidia"  -DMODULE  -DKBUILD_BASENAME='"nv_cray"' -DKBUILD_MODNAME='"nvidia"' -c -o /tmp/akmodsbuild.BDZemvCW/BUILD/nvidia-340xx-kmod-340.107/_kmod_build_5.3.11-200.fc30.x86_64/nv-cray.o /tmp/akmodsbuild.BDZemvCW/BUILD/nvidia-340xx-kmod-340.107/_kmod_build_5.3.11-200.fc30.x86_64/nv-cray.c
2019/11/16 17:44:57 akmodsbuild: cc -Wp,-MD,/tmp/akmodsbuild.BDZemvCW/BUILD/nvidia-340xx-kmod-340.107/_kmod_build_5.3.11-200.fc30.x86_64/.nv-dma.o.d  -nostdinc -isystem /usr/lib/gcc/x86_64-redhat-linux/9/include -I./arch/x86/include -I./arch/x86/include/generated  -I./include -I./arch/x86/include/uapi -I./arch/x86/include/generated/uapi -I./include/uapi -I./include/generated/uapi -include ./include/linux/kconfig.h -include ./include/linux/compiler_types.h -D__KERNEL__ -Wall -Wundef -Werror=strict-prototypes -Wno-trigraphs -fno-strict-aliasing -fno-common -fshort-wchar -fno-PIE -Werror=implicit-function-declaration -Werror=implicit-int -Wno-format-security -Wno-address-of-packed-member -std=gnu89 -mno-sse -mno-mmx -mno-sse2 -mno-3dnow -mno-avx -m64 -falign-jumps=1 -falign-loops=1 -mno-80387 -mno-fp-ret-in-387 -mpreferred-stack-boundary=3 -mskip-rax-setup -mtune=generic -mno-red-zone -mcmodel=kernel -DCONFIG_AS_CFI=1 -DCONFIG_AS_CFI_SIGNAL_FRAME=1 -DCONFIG_AS_CFI_SECTIONS=1 -DCONFIG_AS_SSSE3=1 -DCONFIG_AS_AVX=1 -DCONFIG_AS_AVX2=1 -DCONFIG_AS_AVX512=1 -DCONFIG_AS_SHA1_NI=1 -DCONFIG_AS_SHA256_NI=1 -Wno-sign-compare -fno-asynchronous-unwind-tables -mindirect-branch=thunk-extern -mindirect-branch-register -fno-jump-tables -fno-delete-null-pointer-checks -Wno-frame-address -Wno-format-truncation -Wno-format-overflow -Wno-address-of-packed-member -O2 --param=allow-store-data-races=0 -Wframe-larger-than=2048 -fstack-protector-strong -Wno-unused-but-set-variable -Wimplicit-fallthrough -Wno-unused-const-variable -fvar-tracking-assignments -g -pg -mrecord-mcount -mfentry -DCC_USING_FENTRY -Wdeclaration-after-statement -Wvla -Wno-pointer-sign -Wno-stringop-truncation -fno-strict-overflow -fno-merge-all-constants -fmerge-constants -fno-stack-check -fconserve-stack -Werror=date-time -Werror=incompatible-pointer-types -Werror=designated-init -fmacro-prefix-map=./= -fcf-protection=none -Wno-packed-not-aligned -DNV_MODULE_INSTANCE=0 -DNV_BUILD_MODULE_INSTANCES=0 -UDEBUG -U_DEBUG -DNDEBUG -I/tmp/akmodsbuild.BDZemvCW/BUILD/nvidia-340xx-kmod-340.107/_kmod_build_5.3.11-200.fc30.x86_64 -Wall -MD -Wsign-compare -Wno-cast-qual -Wno-error -D__KERNEL__ -DMODULE -DNVRM -DNV_VERSION_STRING="340.107" -Wno-unused-function -Wuninitialized -fno-strict-aliasing -mno-red-zone -mcmodel=kernel -DNV_UVM_ENABLE -D__linux__ -DNV_DEV_NAME="nvidia"  -DMODULE  -DKBUILD_BASENAME='"nv_dma"' -DKBUILD_MODNAME='"nvidia"' -c -o /tmp/akmodsbuild.BDZemvCW/BUILD/nvidia-340xx-kmod-340.107/_kmod_build_5.3.11-200.fc30.x86_64/nv-dma.o /tmp/akmodsbuild.BDZemvCW/BUILD/nvidia-340xx-kmod-340.107/_kmod_build_5.3.11-200.fc30.x86_64/nv-dma.c
2019/11/16 17:44:57 akmodsbuild: In file included from ./include/linux/byteorder/little_endian.h:11,
2019/11/16 17:44:57 akmodsbuild: from ./arch/x86/include/uapi/asm/byteorder.h:5,
2019/11/16 17:44:57 akmodsbuild: from ./include/asm-generic/bitops/le.h:6,
2019/11/16 17:44:57 akmodsbuild: from ./arch/x86/include/asm/bitops.h:394,
2019/11/16 17:44:57 akmodsbuild: from ./include/linux/bitops.h:19,
2019/11/16 17:44:57 akmodsbuild: from ./include/linux/kernel.h:12,
2019/11/16 17:44:57 akmodsbuild: from ./arch/x86/include/asm/percpu.h:45,
2019/11/16 17:44:57 akmodsbuild: from ./arch/x86/include/asm/current.h:6,
2019/11/16 17:44:57 akmodsbuild: from ./include/linux/sched.h:12,
2019/11/16 17:44:57 akmodsbuild: from ./include/linux/utsname.h:6,
2019/11/16 17:44:57 akmodsbuild: from /tmp/akmodsbuild.BDZemvCW/BUILD/nvidia-340xx-kmod-340.107/_kmod_build_5.3.11-200.fc30.x86_64/nv-linux.h:44,
2019/11/16 17:44:57 akmodsbuild: from /tmp/akmodsbuild.BDZemvCW/BUILD/nvidia-340xx-kmod-340.107/_kmod_build_5.3.11-200.fc30.x86_64/nv-acpi.c:15:
2019/11/16 17:44:57 akmodsbuild: ./include/linux/byteorder/generic.h: In function 'cpu_to_be32_array':
2019/11/16 17:44:57 akmodsbuild: ./include/linux/byteorder/generic.h:195:16: warning: comparison of integer expressions of different signedness: 'int' and 'size_t' {aka 'long unsigned int'} [-Wsign-compare]
2019/11/16 17:44:57 akmodsbuild: 195 |  for (i = 0; i < len; i++)
2019/11/16 17:44:57 akmodsbuild: |                ^
2019/11/16 17:44:57 akmodsbuild: ./include/linux/byteorder/generic.h: In function 'be32_to_cpu_array':
2019/11/16 17:44:57 akmodsbuild: ./include/linux/byteorder/generic.h:203:16: warning: comparison of integer expressions of different signedness: 'int' and 'size_t' {aka 'long unsigned int'} [-Wsign-compare]
2019/11/16 17:44:57 akmodsbuild: 203 |  for (i = 0; i < len; i++)
2019/11/16 17:44:57 akmodsbuild: |                ^
2019/11/16 17:44:57 akmodsbuild: In file included from ./include/linux/byteorder/little_endian.h:11,
2019/11/16 17:44:57 akmodsbuild: from ./arch/x86/include/uapi/asm/byteorder.h:5,
2019/11/16 17:44:57 akmodsbuild: from ./include/asm-generic/bitops/le.h:6,
2019/11/16 17:44:57 akmodsbuild: from ./arch/x86/include/asm/bitops.h:394,
2019/11/16 17:44:57 akmodsbuild: from ./include/linux/bitops.h:19,
2019/11/16 17:44:57 akmodsbuild: from ./include/linux/kernel.h:12,
2019/11/16 17:44:57 akmodsbuild: from ./arch/x86/include/asm/percpu.h:45,
2019/11/16 17:44:57 akmodsbuild: from ./arch/x86/include/asm/current.h:6,
2019/11/16 17:44:57 akmodsbuild: from ./include/linux/sched.h:12,
2019/11/16 17:44:57 akmodsbuild: from ./include/linux/utsname.h:6,
2019/11/16 17:44:57 akmodsbuild: from /tmp/akmodsbuild.BDZemvCW/BUILD/nvidia-340xx-kmod-340.107/_kmod_build_5.3.11-200.fc30.x86_64/nv-linux.h:44,
2019/11/16 17:44:57 akmodsbuild: from /tmp/akmodsbuild.BDZemvCW/BUILD/nvidia-340xx-kmod-340.107/_kmod_build_5.3.11-200.fc30.x86_64/nv-chrdev.c:15:
2019/11/16 17:44:57 akmodsbuild: ./include/linux/byteorder/generic.h: In function 'cpu_to_be32_array':
2019/11/16 17:44:57 akmodsbuild: ./include/linux/byteorder/generic.h:195:16: warning: comparison of integer expressions of different signedness: 'int' and 'size_t' {aka 'long unsigned int'} [-Wsign-compare]
2019/11/16 17:44:57 akmodsbuild: 195 |  for (i = 0; i < len; i++)
2019/11/16 17:44:57 akmodsbuild: |                ^
2019/11/16 17:44:57 akmodsbuild: ./include/linux/byteorder/generic.h: In function 'be32_to_cpu_array':
2019/11/16 17:44:57 akmodsbuild: ./include/linux/byteorder/generic.h:203:16: warning: comparison of integer expressions of different signedness: 'int' and 'size_t' {aka 'long unsigned int'} [-Wsign-compare]
2019/11/16 17:44:57 akmodsbuild: 203 |  for (i = 0; i < len; i++)
2019/11/16 17:44:57 akmodsbuild: |                ^
2019/11/16 17:44:57 akmodsbuild: In file included from ./include/linux/byteorder/little_endian.h:11,
2019/11/16 17:44:57 akmodsbuild: from ./arch/x86/include/uapi/asm/byteorder.h:5,
2019/11/16 17:44:57 akmodsbuild: from ./include/asm-generic/bitops/le.h:6,
2019/11/16 17:44:57 akmodsbuild: from ./arch/x86/include/asm/bitops.h:394,
2019/11/16 17:44:57 akmodsbuild: from ./include/linux/bitops.h:19,
2019/11/16 17:44:57 akmodsbuild: from ./include/linux/kernel.h:12,
2019/11/16 17:44:57 akmodsbuild: from ./arch/x86/include/asm/percpu.h:45,
2019/11/16 17:44:57 akmodsbuild: from ./arch/x86/include/asm/current.h:6,
2019/11/16 17:44:57 akmodsbuild: from ./include/linux/sched.h:12,
2019/11/16 17:44:57 akmodsbuild: from ./include/linux/utsname.h:6,
2019/11/16 17:44:57 akmodsbuild: from /tmp/akmodsbuild.BDZemvCW/BUILD/nvidia-340xx-kmod-340.107/_kmod_build_5.3.11-200.fc30.x86_64/nv-linux.h:44,
2019/11/16 17:44:57 akmodsbuild: from /tmp/akmodsbuild.BDZemvCW/BUILD/nvidia-340xx-kmod-340.107/_kmod_build_5.3.11-200.fc30.x86_64/nv-cray.c:15:
2019/11/16 17:44:57 akmodsbuild: ./include/linux/byteorder/generic.h: In function 'cpu_to_be32_array':
2019/11/16 17:44:57 akmodsbuild: ./include/linux/byteorder/generic.h:195:16: warning: comparison of integer expressions of different signedness: 'int' and 'size_t' {aka 'long unsigned int'} [-Wsign-compare]
2019/11/16 17:44:57 akmodsbuild: 195 |  for (i = 0; i < len; i++)
2019/11/16 17:44:57 akmodsbuild: |                ^
2019/11/16 17:44:57 akmodsbuild: In file included from ./include/linux/byteorder/little_endian.h:11,
2019/11/16 17:44:57 akmodsbuild: from ./arch/x86/include/uapi/asm/byteorder.h:5,
2019/11/16 17:44:57 akmodsbuild: from ./include/asm-generic/bitops/le.h:6,
2019/11/16 17:44:57 akmodsbuild: from ./arch/x86/include/asm/bitops.h:394,
2019/11/16 17:44:57 akmodsbuild: from ./include/linux/bitops.h:19,
2019/11/16 17:44:57 akmodsbuild: from ./include/linux/kernel.h:12,
2019/11/16 17:44:57 akmodsbuild: from ./arch/x86/include/asm/percpu.h:45,
2019/11/16 17:44:57 akmodsbuild: from ./arch/x86/include/asm/current.h:6,
2019/11/16 17:44:57 akmodsbuild: from ./include/linux/sched.h:12,
2019/11/16 17:44:57 akmodsbuild: from ./include/linux/utsname.h:6,
2019/11/16 17:44:57 akmodsbuild: from /tmp/akmodsbuild.BDZemvCW/BUILD/nvidia-340xx-kmod-340.107/_kmod_build_5.3.11-200.fc30.x86_64/nv-linux.h:44,
2019/11/16 17:44:57 akmodsbuild: from /tmp/akmodsbuild.BDZemvCW/BUILD/nvidia-340xx-kmod-340.107/_kmod_build_5.3.11-200.fc30.x86_64/nv-dma.c:15:
2019/11/16 17:44:57 akmodsbuild: ./include/linux/byteorder/generic.h: In function 'cpu_to_be32_array':
2019/11/16 17:44:57 akmodsbuild: ./include/linux/byteorder/generic.h: In function 'be32_to_cpu_array':
2019/11/16 17:44:57 akmodsbuild: ./include/linux/byteorder/generic.h:195:16: warning: comparison of integer expressions of different signedness: 'int' and 'size_t' {aka 'long unsigned int'} [-Wsign-compare]
2019/11/16 17:44:57 akmodsbuild: 195 |  for (i = 0; i < len; i++)
2019/11/16 17:44:57 akmodsbuild: |                ^
2019/11/16 17:44:57 akmodsbuild: ./include/linux/byteorder/generic.h:203:16: warning: comparison of integer expressions of different signedness: 'int' and 'size_t' {aka 'long unsigned int'} [-Wsign-compare]
2019/11/16 17:44:57 akmodsbuild: 203 |  for (i = 0; i < len; i++)
2019/11/16 17:44:57 akmodsbuild: |                ^
2019/11/16 17:44:57 akmodsbuild: ./include/linux/byteorder/generic.h: In function 'be32_to_cpu_array':
2019/11/16 17:44:57 akmodsbuild: ./include/linux/byteorder/generic.h:203:16: warning: comparison of integer expressions of different signedness: 'int' and 'size_t' {aka 'long unsigned int'} [-Wsign-compare]
2019/11/16 17:44:57 akmodsbuild: 203 |  for (i = 0; i < len; i++)
2019/11/16 17:44:57 akmodsbuild: |                ^
2019/11/16 17:44:57 akmodsbuild: In file included from ./arch/x86/include/asm/current.h:5,
2019/11/16 17:44:57 akmodsbuild: from ./include/linux/sched.h:12,
2019/11/16 17:44:57 akmodsbuild: from ./include/linux/utsname.h:6,
2019/11/16 17:44:57 akmodsbuild: from /tmp/akmodsbuild.BDZemvCW/BUILD/nvidia-340xx-kmod-340.107/_kmod_build_5.3.11-200.fc30.x86_64/nv-linux.h:44,
2019/11/16 17:44:57 akmodsbuild: from /tmp/akmodsbuild.BDZemvCW/BUILD/nvidia-340xx-kmod-340.107/_kmod_build_5.3.11-200.fc30.x86_64/nv-chrdev.c:15:
2019/11/16 17:44:57 akmodsbuild: ./include/linux/thread_info.h: In function 'check_copy_size':
2019/11/16 17:44:57 akmodsbuild: In file included from ./arch/x86/include/asm/current.h:5,
2019/11/16 17:44:57 akmodsbuild: from ./include/linux/sched.h:12,
2019/11/16 17:44:57 akmodsbuild: from ./include/linux/utsname.h:6,
2019/11/16 17:44:57 akmodsbuild: from /tmp/akmodsbuild.BDZemvCW/BUILD/nvidia-340xx-kmod-340.107/_kmod_build_5.3.11-200.fc30.x86_64/nv-linux.h:44,
2019/11/16 17:44:57 akmodsbuild: from /tmp/akmodsbuild.BDZemvCW/BUILD/nvidia-340xx-kmod-340.107/_kmod_build_5.3.11-200.fc30.x86_64/nv-acpi.c:15:
2019/11/16 17:44:58 akmodsbuild: ./include/linux/thread_info.h: In function 'check_copy_size':
2019/11/16 17:44:58 akmodsbuild: ./include/linux/thread_info.h:141:29: warning: comparison of integer expressions of different signedness: 'int' and 'size_t' {aka 'long unsigned int'} [-Wsign-compare]
2019/11/16 17:44:58 akmodsbuild: 141 |  if (unlikely(sz >= 0 && sz < bytes)) {
2019/11/16 17:44:58 akmodsbuild: |                             ^
2019/11/16 17:44:58 akmodsbuild: ./include/linux/compiler.h:78:42: note: in definition of macro 'unlikely'
2019/11/16 17:44:58 akmodsbuild: 78 | # define unlikely(x) __builtin_expect(!!(x), 0)
2019/11/16 17:44:58 akmodsbuild: |                                          ^
2019/11/16 17:44:58 akmodsbuild: ./include/linux/thread_info.h:141:29: warning: comparison of integer expressions of different signedness: 'int' and 'size_t' {aka 'long unsigned int'} [-Wsign-compare]
2019/11/16 17:44:58 akmodsbuild: 141 |  if (unlikely(sz >= 0 && sz < bytes)) {
2019/11/16 17:44:58 akmodsbuild: |                             ^
2019/11/16 17:44:58 akmodsbuild: ./include/linux/compiler.h:78:42: note: in definition of macro 'unlikely'
2019/11/16 17:44:58 akmodsbuild: 78 | # define unlikely(x) __builtin_expect(!!(x), 0)
2019/11/16 17:44:58 akmodsbuild: |                                          ^
2019/11/16 17:44:58 akmodsbuild: In file included from ./arch/x86/include/asm/current.h:5,
2019/11/16 17:44:58 akmodsbuild: from ./include/linux/sched.h:12,
2019/11/16 17:44:58 akmodsbuild: from ./include/linux/utsname.h:6,
2019/11/16 17:44:58 akmodsbuild: from /tmp/akmodsbuild.BDZemvCW/BUILD/nvidia-340xx-kmod-340.107/_kmod_build_5.3.11-200.fc30.x86_64/nv-linux.h:44,
2019/11/16 17:44:58 akmodsbuild: from /tmp/akmodsbuild.BDZemvCW/BUILD/nvidia-340xx-kmod-340.107/_kmod_build_5.3.11-200.fc30.x86_64/nv-cray.c:15:
2019/11/16 17:44:58 akmodsbuild: ./include/linux/thread_info.h: In function 'check_copy_size':
2019/11/16 17:44:58 akmodsbuild: ./include/linux/thread_info.h:141:29: warning: comparison of integer expressions of different signedness: 'int' and 'size_t' {aka 'long unsigned int'} [-Wsign-compare]
2019/11/16 17:44:58 akmodsbuild: 141 |  if (unlikely(sz >= 0 && sz < bytes)) {
2019/11/16 17:44:58 akmodsbuild: |                             ^
2019/11/16 17:44:58 akmodsbuild: ./include/linux/compiler.h:78:42: note: in definition of macro 'unlikely'
2019/11/16 17:44:58 akmodsbuild: 78 | # define unlikely(x) __builtin_expect(!!(x), 0)
2019/11/16 17:44:58 akmodsbuild: |                                          ^
2019/11/16 17:44:58 akmodsbuild: In file included from ./arch/x86/include/asm/current.h:5,
2019/11/16 17:44:58 akmodsbuild: from ./include/linux/sched.h:12,
2019/11/16 17:44:58 akmodsbuild: from ./include/linux/utsname.h:6,
2019/11/16 17:44:58 akmodsbuild: from /tmp/akmodsbuild.BDZemvCW/BUILD/nvidia-340xx-kmod-340.107/_kmod_build_5.3.11-200.fc30.x86_64/nv-linux.h:44,
2019/11/16 17:44:58 akmodsbuild: from /tmp/akmodsbuild.BDZemvCW/BUILD/nvidia-340xx-kmod-340.107/_kmod_build_5.3.11-200.fc30.x86_64/nv-dma.c:15:
2019/11/16 17:44:58 akmodsbuild: ./include/linux/thread_info.h: In function 'check_copy_size':
2019/11/16 17:44:58 akmodsbuild: ./include/linux/thread_info.h:141:29: warning: comparison of integer expressions of different signedness: 'int' and 'size_t' {aka 'long unsigned int'} [-Wsign-compare]
2019/11/16 17:44:58 akmodsbuild: 141 |  if (unlikely(sz >= 0 && sz < bytes)) {
2019/11/16 17:44:58 akmodsbuild: |                             ^
2019/11/16 17:44:58 akmodsbuild: ./include/linux/compiler.h:78:42: note: in definition of macro 'unlikely'
2019/11/16 17:44:58 akmodsbuild: 78 | # define unlikely(x) __builtin_expect(!!(x), 0)
2019/11/16 17:44:58 akmodsbuild: |                                          ^
2019/11/16 17:44:58 akmodsbuild: In file included from ./include/linux/mmzone.h:22,
2019/11/16 17:44:58 akmodsbuild: from ./include/linux/gfp.h:6,
2019/11/16 17:44:58 akmodsbuild: from ./include/linux/umh.h:4,
2019/11/16 17:44:58 akmodsbuild: from ./include/linux/kmod.h:9,
2019/11/16 17:44:58 akmodsbuild: from ./include/linux/module.h:13,
2019/11/16 17:44:58 akmodsbuild: from /tmp/akmodsbuild.BDZemvCW/BUILD/nvidia-340xx-kmod-340.107/_kmod_build_5.3.11-200.fc30.x86_64/nv-linux.h:65,
2019/11/16 17:44:58 akmodsbuild: from /tmp/akmodsbuild.BDZemvCW/BUILD/nvidia-340xx-kmod-340.107/_kmod_build_5.3.11-200.fc30.x86_64/nv-chrdev.c:15:
2019/11/16 17:44:58 akmodsbuild: ./include/linux/page-flags.h: In function 'PagePoisoned':
2019/11/16 17:44:58 akmodsbuild: ./include/linux/page-flags.h:194:21: warning: comparison of integer expressions of different signedness: 'long unsigned int' and 'long int' [-Wsign-compare]
2019/11/16 17:44:58 akmodsbuild: 194 |  return page->flags == PAGE_POISON_PATTERN;
2019/11/16 17:44:58 akmodsbuild: |                     ^~
2019/11/16 17:44:58 akmodsbuild: In file included from ./include/linux/mmzone.h:22,
2019/11/16 17:44:58 akmodsbuild: from ./include/linux/gfp.h:6,
2019/11/16 17:44:58 akmodsbuild: from ./include/linux/umh.h:4,
2019/11/16 17:44:58 akmodsbuild: from ./include/linux/kmod.h:9,
2019/11/16 17:44:58 akmodsbuild: from ./include/linux/module.h:13,
2019/11/16 17:44:58 akmodsbuild: from /tmp/akmodsbuild.BDZemvCW/BUILD/nvidia-340xx-kmod-340.107/_kmod_build_5.3.11-200.fc30.x86_64/nv-linux.h:65,
2019/11/16 17:44:58 akmodsbuild: from /tmp/akmodsbuild.BDZemvCW/BUILD/nvidia-340xx-kmod-340.107/_kmod_build_5.3.11-200.fc30.x86_64/nv-cray.c:15:
2019/11/16 17:44:58 akmodsbuild: ./include/linux/page-flags.h: In function 'PagePoisoned':
2019/11/16 17:44:58 akmodsbuild: ./include/linux/page-flags.h:194:21: warning: comparison of integer expressions of different signedness: 'long unsigned int' and 'long int' [-Wsign-compare]
2019/11/16 17:44:58 akmodsbuild: 194 |  return page->flags == PAGE_POISON_PATTERN;
2019/11/16 17:44:58 akmodsbuild: |                     ^~
2019/11/16 17:44:58 akmodsbuild: In file included from ./include/linux/mmzone.h:22,
2019/11/16 17:44:58 akmodsbuild: from ./include/linux/gfp.h:6,
2019/11/16 17:44:58 akmodsbuild: from ./include/linux/umh.h:4,
2019/11/16 17:44:58 akmodsbuild: from ./include/linux/kmod.h:9,
2019/11/16 17:44:58 akmodsbuild: from ./include/linux/module.h:13,
2019/11/16 17:44:58 akmodsbuild: from /tmp/akmodsbuild.BDZemvCW/BUILD/nvidia-340xx-kmod-340.107/_kmod_build_5.3.11-200.fc30.x86_64/nv-linux.h:65,
2019/11/16 17:44:58 akmodsbuild: from /tmp/akmodsbuild.BDZemvCW/BUILD/nvidia-340xx-kmod-340.107/_kmod_build_5.3.11-200.fc30.x86_64/nv-dma.c:15:
2019/11/16 17:44:58 akmodsbuild: ./include/linux/page-flags.h: In function 'PagePoisoned':
2019/11/16 17:44:58 akmodsbuild: ./include/linux/page-flags.h:194:21: warning: comparison of integer expressions of different signedness: 'long unsigned int' and 'long int' [-Wsign-compare]
2019/11/16 17:44:58 akmodsbuild: 194 |  return page->flags == PAGE_POISON_PATTERN;
2019/11/16 17:44:58 akmodsbuild: |                     ^~
2019/11/16 17:44:58 akmodsbuild: In file included from ./arch/x86/include/asm/current.h:5,
2019/11/16 17:44:58 akmodsbuild: from ./include/linux/sched.h:12,
2019/11/16 17:44:58 akmodsbuild: from ./include/linux/utsname.h:6,
2019/11/16 17:44:58 akmodsbuild: from /tmp/akmodsbuild.BDZemvCW/BUILD/nvidia-340xx-kmod-340.107/_kmod_build_5.3.11-200.fc30.x86_64/nv-linux.h:44,
2019/11/16 17:44:58 akmodsbuild: from /tmp/akmodsbuild.BDZemvCW/BUILD/nvidia-340xx-kmod-340.107/_kmod_build_5.3.11-200.fc30.x86_64/nv-chrdev.c:15:
2019/11/16 17:44:58 akmodsbuild: ./include/linux/mmzone.h: In function 'next_zones_zonelist':
2019/11/16 17:44:58 akmodsbuild: ./include/linux/mmzone.h:1035:44: warning: comparison of integer expressions of different signedness: 'int' and 'enum zone_type' [-Wsign-compare]
2019/11/16 17:44:58 akmodsbuild: 1035 |  if (likely(!nodes && zonelist_zone_idx(z) <= highest_zoneidx))
2019/11/16 17:44:58 akmodsbuild: |                                            ^~
2019/11/16 17:44:58 akmodsbuild: ./include/linux/compiler.h:77:40: note: in definition of macro 'likely'
2019/11/16 17:44:58 akmodsbuild: 77 | # define likely(x) __builtin_expect(!!(x), 1)
2019/11/16 17:44:58 akmodsbuild: |                                        ^
2019/11/16 17:44:58 akmodsbuild: In file included from ./include/linux/mmzone.h:22,
2019/11/16 17:44:58 akmodsbuild: from ./include/linux/gfp.h:6,
2019/11/16 17:44:58 akmodsbuild: from ./include/linux/umh.h:4,
2019/11/16 17:44:58 akmodsbuild: from ./include/linux/kmod.h:9,
2019/11/16 17:44:58 akmodsbuild: from ./include/linux/module.h:13,
2019/11/16 17:44:58 akmodsbuild: from /tmp/akmodsbuild.BDZemvCW/BUILD/nvidia-340xx-kmod-340.107/_kmod_build_5.3.11-200.fc30.x86_64/nv-linux.h:65,
2019/11/16 17:44:58 akmodsbuild: from /tmp/akmodsbuild.BDZemvCW/BUILD/nvidia-340xx-kmod-340.107/_kmod_build_5.3.11-200.fc30.x86_64/nv-acpi.c:15:
2019/11/16 17:44:58 akmodsbuild: ./include/linux/page-flags.h: In function 'PagePoisoned':
2019/11/16 17:44:58 akmodsbuild: ./include/linux/page-flags.h:194:21: warning: comparison of integer expressions of different signedness: 'long unsigned int' and 'long int' [-Wsign-compare]
2019/11/16 17:44:58 akmodsbuild: 194 |  return page->flags == PAGE_POISON_PATTERN;
2019/11/16 17:44:58 akmodsbuild: |                     ^~
2019/11/16 17:44:58 akmodsbuild: In file included from ./arch/x86/include/asm/current.h:5,
2019/11/16 17:44:58 akmodsbuild: from ./include/linux/sched.h:12,
2019/11/16 17:44:58 akmodsbuild: from ./include/linux/utsname.h:6,
2019/11/16 17:44:58 akmodsbuild: from /tmp/akmodsbuild.BDZemvCW/BUILD/nvidia-340xx-kmod-340.107/_kmod_build_5.3.11-200.fc30.x86_64/nv-linux.h:44,
2019/11/16 17:44:58 akmodsbuild: from /tmp/akmodsbuild.BDZemvCW/BUILD/nvidia-340xx-kmod-340.107/_kmod_build_5.3.11-200.fc30.x86_64/nv-cray.c:15:
2019/11/16 17:44:58 akmodsbuild: ./include/linux/mmzone.h: In function 'next_zones_zonelist':
2019/11/16 17:44:58 akmodsbuild: ./include/linux/mmzone.h:1035:44: warning: comparison of integer expressions of different signedness: 'int' and 'enum zone_type' [-Wsign-compare]
2019/11/16 17:44:58 akmodsbuild: 1035 |  if (likely(!nodes && zonelist_zone_idx(z) <= highest_zoneidx))
2019/11/16 17:44:58 akmodsbuild: |                                            ^~
2019/11/16 17:44:58 akmodsbuild: ./include/linux/compiler.h:77:40: note: in definition of macro 'likely'
2019/11/16 17:44:58 akmodsbuild: 77 | # define likely(x) __builtin_expect(!!(x), 1)
2019/11/16 17:44:58 akmodsbuild: |                                        ^
2019/11/16 17:44:58 akmodsbuild: In file included from ./arch/x86/include/asm/current.h:5,
2019/11/16 17:44:58 akmodsbuild: from ./include/linux/sched.h:12,
2019/11/16 17:44:58 akmodsbuild: from ./include/linux/utsname.h:6,
2019/11/16 17:44:58 akmodsbuild: from /tmp/akmodsbuild.BDZemvCW/BUILD/nvidia-340xx-kmod-340.107/_kmod_build_5.3.11-200.fc30.x86_64/nv-linux.h:44,
2019/11/16 17:44:58 akmodsbuild: from /tmp/akmodsbuild.BDZemvCW/BUILD/nvidia-340xx-kmod-340.107/_kmod_build_5.3.11-200.fc30.x86_64/nv-dma.c:15:
2019/11/16 17:44:58 akmodsbuild: ./include/linux/mmzone.h: In function 'next_zones_zonelist':
2019/11/16 17:44:58 akmodsbuild: ./include/linux/mmzone.h:1035:44: warning: comparison of integer expressions of different signedness: 'int' and 'enum zone_type' [-Wsign-compare]
2019/11/16 17:44:58 akmodsbuild: 1035 |  if (likely(!nodes && zonelist_zone_idx(z) <= highest_zoneidx))
2019/11/16 17:44:58 akmodsbuild: |                                            ^~
2019/11/16 17:44:58 akmodsbuild: ./include/linux/compiler.h:77:40: note: in definition of macro 'likely'
2019/11/16 17:44:58 akmodsbuild: 77 | # define likely(x) __builtin_expect(!!(x), 1)
2019/11/16 17:44:58 akmodsbuild: |                                        ^
2019/11/16 17:44:58 akmodsbuild: In file included from ./arch/x86/include/asm/current.h:5,
2019/11/16 17:44:58 akmodsbuild: from ./include/linux/sched.h:12,
2019/11/16 17:44:58 akmodsbuild: from ./include/linux/utsname.h:6,
2019/11/16 17:44:58 akmodsbuild: from /tmp/akmodsbuild.BDZemvCW/BUILD/nvidia-340xx-kmod-340.107/_kmod_build_5.3.11-200.fc30.x86_64/nv-linux.h:44,
2019/11/16 17:44:58 akmodsbuild: from /tmp/akmodsbuild.BDZemvCW/BUILD/nvidia-340xx-kmod-340.107/_kmod_build_5.3.11-200.fc30.x86_64/nv-acpi.c:15:
2019/11/16 17:44:58 akmodsbuild: ./include/linux/mmzone.h: In function 'next_zones_zonelist':
2019/11/16 17:44:58 akmodsbuild: ./include/linux/mmzone.h:1035:44: warning: comparison of integer expressions of different signedness: 'int' and 'enum zone_type' [-Wsign-compare]
2019/11/16 17:44:58 akmodsbuild: 1035 |  if (likely(!nodes && zonelist_zone_idx(z) <= highest_zoneidx))
2019/11/16 17:44:58 akmodsbuild: |                                            ^~
2019/11/16 17:44:58 akmodsbuild: ./include/linux/compiler.h:77:40: note: in definition of macro 'likely'
2019/11/16 17:44:58 akmodsbuild: 77 | # define likely(x) __builtin_expect(!!(x), 1)
2019/11/16 17:44:58 akmodsbuild: |                                        ^
2019/11/16 17:44:58 akmodsbuild: In file included from ./arch/x86/include/asm/current.h:6,
2019/11/16 17:44:58 akmodsbuild: from ./include/linux/sched.h:12,
2019/11/16 17:44:58 akmodsbuild: from ./include/linux/utsname.h:6,
2019/11/16 17:44:58 akmodsbuild: from /tmp/akmodsbuild.BDZemvCW/BUILD/nvidia-340xx-kmod-340.107/_kmod_build_5.3.11-200.fc30.x86_64/nv-linux.h:44,
2019/11/16 17:44:58 akmodsbuild: from /tmp/akmodsbuild.BDZemvCW/BUILD/nvidia-340xx-kmod-340.107/_kmod_build_5.3.11-200.fc30.x86_64/nv-chrdev.c:15:
2019/11/16 17:44:58 akmodsbuild: ./include/linux/percpu-refcount.h: In function 'percpu_ref_get_many':
2019/11/16 17:44:58 akmodsbuild: ./arch/x86/include/asm/percpu.h:131:31: warning: comparison of integer expressions of different signedness: 'long unsigned int' and 'int' [-Wsign-compare]
2019/11/16 17:44:58 akmodsbuild: 131 |          ((val) == 1 || (val) == -1)) ?        |                               ^~
2019/11/16 17:44:58 akmodsbuild: ./arch/x86/include/asm/percpu.h:432:34: note: in expansion of macro 'percpu_add_op'
2019/11/16 17:44:58 akmodsbuild: 432 | #define this_cpu_add_1(pcp, val) percpu_add_op(volatile, (pcp), val)
2019/11/16 17:44:58 akmodsbuild: |                                  ^~~~~~~~~~~~~
2019/11/16 17:44:58 akmodsbuild: ./include/linux/percpu-defs.h:378:11: note: in expansion of macro 'this_cpu_add_1'
2019/11/16 17:44:58 akmodsbuild: 378 |   case 1: stem##1(variable, __VA_ARGS__);break;        |           ^~~~
2019/11/16 17:44:58 akmodsbuild: ./include/linux/percpu-defs.h:510:33: note: in expansion of macro '__pcpu_size_call'
2019/11/16 17:44:58 akmodsbuild: 510 | #define this_cpu_add(pcp, val)  __pcpu_size_call(this_cpu_add_, pcp, val)
2019/11/16 17:44:58 akmodsbuild: |                                 ^~~~~~~~~~~~~~~~
2019/11/16 17:44:58 akmodsbuild: ./include/linux/percpu-refcount.h:192:3: note: in expansion of macro 'this_cpu_add'
2019/11/16 17:44:58 akmodsbuild: 192 |   this_cpu_add(*percpu_count, nr);
2019/11/16 17:44:58 akmodsbuild: |   ^~~~~~~~~~~~
2019/11/16 17:44:58 akmodsbuild: ./arch/x86/include/asm/percpu.h:131:31: warning: comparison of integer expressions of different signedness: 'long unsigned int' and 'int' [-Wsign-compare]
2019/11/16 17:44:58 akmodsbuild: 131 |          ((val) == 1 || (val) == -1)) ?        |                               ^~
2019/11/16 17:44:58 akmodsbuild: ./arch/x86/include/asm/percpu.h:433:34: note: in expansion of macro 'percpu_add_op'
2019/11/16 17:44:58 akmodsbuild: 433 | #define this_cpu_add_2(pcp, val) percpu_add_op(volatile, (pcp), val)
2019/11/16 17:44:58 akmodsbuild: |                                  ^~~~~~~~~~~~~
2019/11/16 17:44:58 akmodsbuild: ./include/linux/percpu-defs.h:379:11: note: in expansion of macro 'this_cpu_add_2'
2019/11/16 17:44:58 akmodsbuild: 379 |   case 2: stem##2(variable, __VA_ARGS__);break;        |           ^~~~
2019/11/16 17:44:58 akmodsbuild: ./include/linux/percpu-defs.h:510:33: note: in expansion of macro '__pcpu_size_call'
2019/11/16 17:44:58 akmodsbuild: 510 | #define this_cpu_add(pcp, val)  __pcpu_size_call(this_cpu_add_, pcp, val)
2019/11/16 17:44:58 akmodsbuild: |                                 ^~~~~~~~~~~~~~~~
2019/11/16 17:44:58 akmodsbuild: ./include/linux/percpu-refcount.h:192:3: note: in expansion of macro 'this_cpu_add'
2019/11/16 17:44:58 akmodsbuild: 192 |   this_cpu_add(*percpu_count, nr);
2019/11/16 17:44:58 akmodsbuild: |   ^~~~~~~~~~~~
2019/11/16 17:44:58 akmodsbuild: ./arch/x86/include/asm/percpu.h:131:31: warning: comparison of integer expressions of different signedness: 'long unsigned int' and 'int' [-Wsign-compare]
2019/11/16 17:44:58 akmodsbuild: 131 |          ((val) == 1 || (val) == -1)) ?        |                               ^~
2019/11/16 17:44:58 akmodsbuild: ./arch/x86/include/asm/percpu.h:434:34: note: in expansion of macro 'percpu_add_op'
2019/11/16 17:44:58 akmodsbuild: 434 | #define this_cpu_add_4(pcp, val) percpu_add_op(volatile, (pcp), val)
2019/11/16 17:44:58 akmodsbuild: |                                  ^~~~~~~~~~~~~
2019/11/16 17:44:58 akmodsbuild: ./include/linux/percpu-defs.h:380:11: note: in expansion of macro 'this_cpu_add_4'
2019/11/16 17:44:58 akmodsbuild: 380 |   case 4: stem##4(variable, __VA_ARGS__);break;        |           ^~~~
2019/11/16 17:44:58 akmodsbuild: ./include/linux/percpu-defs.h:510:33: note: in expansion of macro '__pcpu_size_call'
2019/11/16 17:44:58 akmodsbuild: 510 | #define this_cpu_add(pcp, val)  __pcpu_size_call(this_cpu_add_, pcp, val)
2019/11/16 17:44:58 akmodsbuild: |                                 ^~~~~~~~~~~~~~~~
2019/11/16 17:44:58 akmodsbuild: ./include/linux/percpu-refcount.h:192:3: note: in expansion of macro 'this_cpu_add'
2019/11/16 17:44:58 akmodsbuild: 192 |   this_cpu_add(*percpu_count, nr);
2019/11/16 17:44:58 akmodsbuild: |   ^~~~~~~~~~~~
2019/11/16 17:44:58 akmodsbuild: ./arch/x86/include/asm/percpu.h:131:31: warning: comparison of integer expressions of different signedness: 'long unsigned int' and 'int' [-Wsign-compare]
2019/11/16 17:44:58 akmodsbuild: 131 |          ((val) == 1 || (val) == -1)) ?        |                               ^~
2019/11/16 17:44:58 akmodsbuild: ./arch/x86/include/asm/percpu.h:492:35: note: in expansion of macro 'percpu_add_op'
2019/11/16 17:44:58 akmodsbuild: 492 | #define this_cpu_add_8(pcp, val)  percpu_add_op(volatile, (pcp), val)
2019/11/16 17:44:58 akmodsbuild: |                                   ^~~~~~~~~~~~~
2019/11/16 17:44:58 akmodsbuild: ./include/linux/percpu-defs.h:381:11: note: in expansion of macro 'this_cpu_add_8'
2019/11/16 17:44:58 akmodsbuild: 381 |   case 8: stem##8(variable, __VA_ARGS__);break;        |           ^~~~
2019/11/16 17:44:58 akmodsbuild: ./include/linux/percpu-defs.h:510:33: note: in expansion of macro '__pcpu_size_call'
2019/11/16 17:44:58 akmodsbuild: 510 | #define this_cpu_add(pcp, val)  __pcpu_size_call(this_cpu_add_, pcp, val)
2019/11/16 17:44:58 akmodsbuild: |                                 ^~~~~~~~~~~~~~~~
2019/11/16 17:44:58 akmodsbuild: ./include/linux/percpu-refcount.h:192:3: note: in expansion of macro 'this_cpu_add'
2019/11/16 17:44:58 akmodsbuild: 192 |   this_cpu_add(*percpu_count, nr);
2019/11/16 17:44:58 akmodsbuild: |   ^~~~~~~~~~~~
2019/11/16 17:44:58 akmodsbuild: In file included from ./arch/x86/include/asm/current.h:6,
2019/11/16 17:44:58 akmodsbuild: from ./include/linux/sched.h:12,
2019/11/16 17:44:58 akmodsbuild: from ./include/linux/utsname.h:6,
2019/11/16 17:44:58 akmodsbuild: from /tmp/akmodsbuild.BDZemvCW/BUILD/nvidia-340xx-kmod-340.107/_kmod_build_5.3.11-200.fc30.x86_64/nv-linux.h:44,
2019/11/16 17:44:58 akmodsbuild: from /tmp/akmodsbuild.BDZemvCW/BUILD/nvidia-340xx-kmod-340.107/_kmod_build_5.3.11-200.fc30.x86_64/nv-cray.c:15:
2019/11/16 17:44:58 akmodsbuild: ./include/linux/percpu-refcount.h: In function 'percpu_ref_get_many':
2019/11/16 17:44:58 akmodsbuild: ./arch/x86/include/asm/percpu.h:131:31: warning: comparison of integer expressions of different signedness: 'long unsigned int' and 'int' [-Wsign-compare]
2019/11/16 17:44:58 akmodsbuild: 131 |          ((val) == 1 || (val) == -1)) ?        |                               ^~
2019/11/16 17:44:58 akmodsbuild: ./arch/x86/include/asm/percpu.h:432:34: note: in expansion of macro 'percpu_add_op'
2019/11/16 17:44:58 akmodsbuild: 432 | #define this_cpu_add_1(pcp, val) percpu_add_op(volatile, (pcp), val)
2019/11/16 17:44:58 akmodsbuild: |                                  ^~~~~~~~~~~~~
2019/11/16 17:44:58 akmodsbuild: ./include/linux/percpu-defs.h:378:11: note: in expansion of macro 'this_cpu_add_1'
2019/11/16 17:44:58 akmodsbuild: 378 |   case 1: stem##1(variable, __VA_ARGS__);break;        |           ^~~~
2019/11/16 17:44:58 akmodsbuild: ./include/linux/percpu-defs.h:510:33: note: in expansion of macro '__pcpu_size_call'
2019/11/16 17:44:58 akmodsbuild: 510 | #define this_cpu_add(pcp, val)  __pcpu_size_call(this_cpu_add_, pcp, val)
2019/11/16 17:44:58 akmodsbuild: |                                 ^~~~~~~~~~~~~~~~
2019/11/16 17:44:58 akmodsbuild: ./include/linux/percpu-refcount.h:192:3: note: in expansion of macro 'this_cpu_add'
2019/11/16 17:44:58 akmodsbuild: 192 |   this_cpu_add(*percpu_count, nr);
2019/11/16 17:44:58 akmodsbuild: |   ^~~~~~~~~~~~
2019/11/16 17:44:58 akmodsbuild: ./arch/x86/include/asm/percpu.h:131:31: warning: comparison of integer expressions of different signedness: 'long unsigned int' and 'int' [-Wsign-compare]
2019/11/16 17:44:58 akmodsbuild: 131 |          ((val) == 1 || (val) == -1)) ?        |                               ^~
2019/11/16 17:44:58 akmodsbuild: ./arch/x86/include/asm/percpu.h:433:34: note: in expansion of macro 'percpu_add_op'
2019/11/16 17:44:58 akmodsbuild: 433 | #define this_cpu_add_2(pcp, val) percpu_add_op(volatile, (pcp), val)
2019/11/16 17:44:58 akmodsbuild: |                                  ^~~~~~~~~~~~~
2019/11/16 17:44:58 akmodsbuild: ./include/linux/percpu-defs.h:379:11: note: in expansion of macro 'this_cpu_add_2'
2019/11/16 17:44:58 akmodsbuild: 379 |   case 2: stem##2(variable, __VA_ARGS__);break;        |           ^~~~
2019/11/16 17:44:58 akmodsbuild: ./include/linux/percpu-defs.h:510:33: note: in expansion of macro '__pcpu_size_call'
2019/11/16 17:44:58 akmodsbuild: 510 | #define this_cpu_add(pcp, val)  __pcpu_size_call(this_cpu_add_, pcp, val)
2019/11/16 17:44:58 akmodsbuild: |                                 ^~~~~~~~~~~~~~~~
2019/11/16 17:44:58 akmodsbuild: ./include/linux/percpu-refcount.h:192:3: note: in expansion of macro 'this_cpu_add'
2019/11/16 17:44:58 akmodsbuild: 192 |   this_cpu_add(*percpu_count, nr);
2019/11/16 17:44:58 akmodsbuild: |   ^~~~~~~~~~~~
2019/11/16 17:44:58 akmodsbuild: ./arch/x86/include/asm/percpu.h:131:31: warning: comparison of integer expressions of different signedness: 'long unsigned int' and 'int' [-Wsign-compare]
2019/11/16 17:44:58 akmodsbuild: 131 |          ((val) == 1 || (val) == -1)) ?        |                               ^~
2019/11/16 17:44:58 akmodsbuild: ./arch/x86/include/asm/percpu.h:434:34: note: in expansion of macro 'percpu_add_op'
2019/11/16 17:44:58 akmodsbuild: 434 | #define this_cpu_add_4(pcp, val) percpu_add_op(volatile, (pcp), val)
2019/11/16 17:44:58 akmodsbuild: |                                  ^~~~~~~~~~~~~
2019/11/16 17:44:58 akmodsbuild: ./include/linux/percpu-defs.h:380:11: note: in expansion of macro 'this_cpu_add_4'
2019/11/16 17:44:58 akmodsbuild: 380 |   case 4: stem##4(variable, __VA_ARGS__);break;        |           ^~~~
2019/11/16 17:44:58 akmodsbuild: ./include/linux/percpu-defs.h:510:33: note: in expansion of macro '__pcpu_size_call'
2019/11/16 17:44:58 akmodsbuild: 510 | #define this_cpu_add(pcp, val)  __pcpu_size_call(this_cpu_add_, pcp, val)
2019/11/16 17:44:58 akmodsbuild: |                                 ^~~~~~~~~~~~~~~~
2019/11/16 17:44:58 akmodsbuild: ./include/linux/percpu-refcount.h:192:3: note: in expansion of macro 'this_cpu_add'
2019/11/16 17:44:58 akmodsbuild: 192 |   this_cpu_add(*percpu_count, nr);
2019/11/16 17:44:58 akmodsbuild: |   ^~~~~~~~~~~~
2019/11/16 17:44:58 akmodsbuild: ./arch/x86/include/asm/percpu.h:131:31: warning: comparison of integer expressions of different signedness: 'long unsigned int' and 'int' [-Wsign-compare]
2019/11/16 17:44:58 akmodsbuild: 131 |          ((val) == 1 || (val) == -1)) ?        |                               ^~
2019/11/16 17:44:58 akmodsbuild: ./arch/x86/include/asm/percpu.h:492:35: note: in expansion of macro 'percpu_add_op'
2019/11/16 17:44:58 akmodsbuild: 492 | #define this_cpu_add_8(pcp, val)  percpu_add_op(volatile, (pcp), val)
2019/11/16 17:44:58 akmodsbuild: |                                   ^~~~~~~~~~~~~
2019/11/16 17:44:58 akmodsbuild: ./include/linux/percpu-defs.h:381:11: note: in expansion of macro 'this_cpu_add_8'
2019/11/16 17:44:58 akmodsbuild: 381 |   case 8: stem##8(variable, __VA_ARGS__);break;        |           ^~~~
2019/11/16 17:44:58 akmodsbuild: ./include/linux/percpu-defs.h:510:33: note: in expansion of macro '__pcpu_size_call'
2019/11/16 17:44:58 akmodsbuild: 510 | #define this_cpu_add(pcp, val)  __pcpu_size_call(this_cpu_add_, pcp, val)
2019/11/16 17:44:58 akmodsbuild: |                                 ^~~~~~~~~~~~~~~~
2019/11/16 17:44:58 akmodsbuild: ./include/linux/percpu-refcount.h:192:3: note: in expansion of macro 'this_cpu_add'
2019/11/16 17:44:58 akmodsbuild: 192 |   this_cpu_add(*percpu_count, nr);
2019/11/16 17:44:58 akmodsbuild: |   ^~~~~~~~~~~~
2019/11/16 17:44:58 akmodsbuild: ./include/linux/percpu-refcount.h: In function 'percpu_ref_put_many':
2019/11/16 17:44:58 akmodsbuild: ./arch/x86/include/asm/percpu.h:131:31: warning: comparison of integer expressions of different signedness: 'long unsigned int' and 'int' [-Wsign-compare]
2019/11/16 17:44:58 akmodsbuild: 131 |          ((val) == 1 || (val) == -1)) ?        |                               ^~
2019/11/16 17:44:58 akmodsbuild: ./arch/x86/include/asm/percpu.h:432:34: note: in expansion of macro 'percpu_add_op'
2019/11/16 17:44:58 akmodsbuild: 432 | #define this_cpu_add_1(pcp, val) percpu_add_op(volatile, (pcp), val)
2019/11/16 17:44:58 akmodsbuild: |                                  ^~~~~~~~~~~~~
2019/11/16 17:44:58 akmodsbuild: ./include/linux/percpu-defs.h:378:11: note: in expansion of macro 'this_cpu_add_1'
2019/11/16 17:44:58 akmodsbuild: 378 |   case 1: stem##1(variable, __VA_ARGS__);break;        |           ^~~~
2019/11/16 17:44:58 akmodsbuild: ./include/linux/percpu-defs.h:510:33: note: in expansion of macro '__pcpu_size_call'
2019/11/16 17:44:58 akmodsbuild: 510 | #define this_cpu_add(pcp, val)  __pcpu_size_call(this_cpu_add_, pcp, val)
2019/11/16 17:44:58 akmodsbuild: |                                 ^~~~~~~~~~~~~~~~
2019/11/16 17:44:58 akmodsbuild: ./include/linux/percpu-defs.h:520:33: note: in expansion of macro 'this_cpu_add'
2019/11/16 17:44:58 akmodsbuild: 520 | #define this_cpu_sub(pcp, val)  this_cpu_add(pcp, -(typeof(pcp))(val))
2019/11/16 17:44:58 akmodsbuild: |                                 ^~~~~~~~~~~~
2019/11/16 17:44:58 akmodsbuild: ./include/linux/percpu-refcount.h:291:3: note: in expansion of macro 'this_cpu_sub'
2019/11/16 17:44:58 akmodsbuild: 291 |   this_cpu_sub(*percpu_count, nr);
2019/11/16 17:44:58 akmodsbuild: |   ^~~~~~~~~~~~
2019/11/16 17:44:58 akmodsbuild: ./arch/x86/include/asm/percpu.h:131:31: warning: comparison of integer expressions of different signedness: 'long unsigned int' and 'int' [-Wsign-compare]
2019/11/16 17:44:58 akmodsbuild: 131 |          ((val) == 1 || (val) == -1)) ?        |                               ^~
2019/11/16 17:44:58 akmodsbuild: ./arch/x86/include/asm/percpu.h:433:34: note: in expansion of macro 'percpu_add_op'
2019/11/16 17:44:58 akmodsbuild: 433 | #define this_cpu_add_2(pcp, val) percpu_add_op(volatile, (pcp), val)
2019/11/16 17:44:58 akmodsbuild: |                                  ^~~~~~~~~~~~~
2019/11/16 17:44:58 akmodsbuild: ./include/linux/percpu-defs.h:379:11: note: in expansion of macro 'this_cpu_add_2'
2019/11/16 17:44:58 akmodsbuild: 379 |   case 2: stem##2(variable, __VA_ARGS__);break;        |           ^~~~
2019/11/16 17:44:58 akmodsbuild: ./include/linux/percpu-defs.h:510:33: note: in expansion of macro '__pcpu_size_call'
2019/11/16 17:44:58 akmodsbuild: 510 | #define this_cpu_add(pcp, val)  __pcpu_size_call(this_cpu_add_, pcp, val)
2019/11/16 17:44:58 akmodsbuild: |                                 ^~~~~~~~~~~~~~~~
2019/11/16 17:44:58 akmodsbuild: ./include/linux/percpu-defs.h:520:33: note: in expansion of macro 'this_cpu_add'
2019/11/16 17:44:58 akmodsbuild: 520 | #define this_cpu_sub(pcp, val)  this_cpu_add(pcp, -(typeof(pcp))(val))
2019/11/16 17:44:59 akmodsbuild: |                                 ^~~~~~~~~~~~
2019/11/16 17:44:59 akmodsbuild: ./include/linux/percpu-refcount.h:291:3: note: in expansion of macro 'this_cpu_sub'
2019/11/16 17:44:59 akmodsbuild: 291 |   this_cpu_sub(*percpu_count, nr);
2019/11/16 17:44:59 akmodsbuild: |   ^~~~~~~~~~~~
2019/11/16 17:44:59 akmodsbuild: ./arch/x86/include/asm/percpu.h:131:31: warning: comparison of integer expressions of different signedness: 'long unsigned int' and 'int' [-Wsign-compare]
2019/11/16 17:44:59 akmodsbuild: 131 |          ((val) == 1 || (val) == -1)) ?        |                               ^~
2019/11/16 17:44:59 akmodsbuild: ./arch/x86/include/asm/percpu.h:434:34: note: in expansion of macro 'percpu_add_op'
2019/11/16 17:44:59 akmodsbuild: 434 | #define this_cpu_add_4(pcp, val) percpu_add_op(volatile, (pcp), val)
2019/11/16 17:44:59 akmodsbuild: |                                  ^~~~~~~~~~~~~
2019/11/16 17:44:59 akmodsbuild: ./include/linux/percpu-defs.h:380:11: note: in expansion of macro 'this_cpu_add_4'
2019/11/16 17:44:59 akmodsbuild: 380 |   case 4: stem##4(variable, __VA_ARGS__);break;        |           ^~~~
2019/11/16 17:44:59 akmodsbuild: ./include/linux/percpu-defs.h:510:33: note: in expansion of macro '__pcpu_size_call'
2019/11/16 17:44:59 akmodsbuild: 510 | #define this_cpu_add(pcp, val)  __pcpu_size_call(this_cpu_add_, pcp, val)
2019/11/16 17:44:59 akmodsbuild: |                                 ^~~~~~~~~~~~~~~~
2019/11/16 17:44:59 akmodsbuild: ./include/linux/percpu-defs.h:520:33: note: in expansion of macro 'this_cpu_add'
2019/11/16 17:44:59 akmodsbuild: 520 | #define this_cpu_sub(pcp, val)  this_cpu_add(pcp, -(typeof(pcp))(val))
2019/11/16 17:44:59 akmodsbuild: |                                 ^~~~~~~~~~~~
2019/11/16 17:44:59 akmodsbuild: ./include/linux/percpu-refcount.h:291:3: note: in expansion of macro 'this_cpu_sub'
2019/11/16 17:44:59 akmodsbuild: 291 |   this_cpu_sub(*percpu_count, nr);
2019/11/16 17:44:59 akmodsbuild: |   ^~~~~~~~~~~~
2019/11/16 17:44:59 akmodsbuild: ./arch/x86/include/asm/percpu.h:131:31: warning: comparison of integer expressions of different signedness: 'long unsigned int' and 'int' [-Wsign-compare]
2019/11/16 17:44:59 akmodsbuild: 131 |          ((val) == 1 || (val) == -1)) ?        |                               ^~
2019/11/16 17:44:59 akmodsbuild: ./arch/x86/include/asm/percpu.h:492:35: note: in expansion of macro 'percpu_add_op'
2019/11/16 17:44:59 akmodsbuild: 492 | #define this_cpu_add_8(pcp, val)  percpu_add_op(volatile, (pcp), val)
2019/11/16 17:44:59 akmodsbuild: |                                   ^~~~~~~~~~~~~
2019/11/16 17:44:59 akmodsbuild: ./include/linux/percpu-defs.h:381:11: note: in expansion of macro 'this_cpu_add_8'
2019/11/16 17:44:59 akmodsbuild: 381 |   case 8: stem##8(variable, __VA_ARGS__);break;        |           ^~~~
2019/11/16 17:44:59 akmodsbuild: ./include/linux/percpu-defs.h:510:33: note: in expansion of macro '__pcpu_size_call'
2019/11/16 17:44:59 akmodsbuild: 510 | #define this_cpu_add(pcp, val)  __pcpu_size_call(this_cpu_add_, pcp, val)
2019/11/16 17:44:59 akmodsbuild: |                                 ^~~~~~~~~~~~~~~~
2019/11/16 17:44:59 akmodsbuild: ./include/linux/percpu-defs.h:520:33: note: in expansion of macro 'this_cpu_add'
2019/11/16 17:44:59 akmodsbuild: 520 | #define this_cpu_sub(pcp, val)  this_cpu_add(pcp, -(typeof(pcp))(val))
2019/11/16 17:44:59 akmodsbuild: |                                 ^~~~~~~~~~~~
2019/11/16 17:44:59 akmodsbuild: ./include/linux/percpu-refcount.h:291:3: note: in expansion of macro 'this_cpu_sub'
2019/11/16 17:44:59 akmodsbuild: 291 |   this_cpu_sub(*percpu_count, nr);
2019/11/16 17:44:59 akmodsbuild: |   ^~~~~~~~~~~~
2019/11/16 17:44:59 akmodsbuild: ./include/linux/percpu-refcount.h: In function 'percpu_ref_put_many':
2019/11/16 17:44:59 akmodsbuild: ./arch/x86/include/asm/percpu.h:131:31: warning: comparison of integer expressions of different signedness: 'long unsigned int' and 'int' [-Wsign-compare]
2019/11/16 17:44:59 akmodsbuild: 131 |          ((val) == 1 || (val) == -1)) ?        |                               ^~
2019/11/16 17:44:59 akmodsbuild: ./arch/x86/include/asm/percpu.h:432:34: note: in expansion of macro 'percpu_add_op'
2019/11/16 17:44:59 akmodsbuild: 432 | #define this_cpu_add_1(pcp, val) percpu_add_op(volatile, (pcp), val)
2019/11/16 17:44:59 akmodsbuild: |                                  ^~~~~~~~~~~~~
2019/11/16 17:44:59 akmodsbuild: ./include/linux/percpu-defs.h:378:11: note: in expansion of macro 'this_cpu_add_1'
2019/11/16 17:44:59 akmodsbuild: 378 |   case 1: stem##1(variable, __VA_ARGS__);break;        |           ^~~~
2019/11/16 17:44:59 akmodsbuild: ./include/linux/percpu-defs.h:510:33: note: in expansion of macro '__pcpu_size_call'
2019/11/16 17:44:59 akmodsbuild: 510 | #define this_cpu_add(pcp, val)  __pcpu_size_call(this_cpu_add_, pcp, val)
2019/11/16 17:44:59 akmodsbuild: |                                 ^~~~~~~~~~~~~~~~
2019/11/16 17:44:59 akmodsbuild: ./include/linux/percpu-defs.h:520:33: note: in expansion of macro 'this_cpu_add'
2019/11/16 17:44:59 akmodsbuild: 520 | #define this_cpu_sub(pcp, val)  this_cpu_add(pcp, -(typeof(pcp))(val))
2019/11/16 17:44:59 akmodsbuild: |                                 ^~~~~~~~~~~~
2019/11/16 17:44:59 akmodsbuild: ./include/linux/percpu-refcount.h:291:3: note: in expansion of macro 'this_cpu_sub'
2019/11/16 17:44:59 akmodsbuild: 291 |   this_cpu_sub(*percpu_count, nr);
2019/11/16 17:44:59 akmodsbuild: |   ^~~~~~~~~~~~
2019/11/16 17:44:59 akmodsbuild: ./arch/x86/include/asm/percpu.h:131:31: warning: comparison of integer expressions of different signedness: 'long unsigned int' and 'int' [-Wsign-compare]
2019/11/16 17:44:59 akmodsbuild: 131 |          ((val) == 1 || (val) == -1)) ?        |                               ^~
2019/11/16 17:44:59 akmodsbuild: ./arch/x86/include/asm/percpu.h:433:34: note: in expansion of macro 'percpu_add_op'
2019/11/16 17:44:59 akmodsbuild: 433 | #define this_cpu_add_2(pcp, val) percpu_add_op(volatile, (pcp), val)
2019/11/16 17:44:59 akmodsbuild: |                                  ^~~~~~~~~~~~~
2019/11/16 17:44:59 akmodsbuild: ./include/linux/percpu-defs.h:379:11: note: in expansion of macro 'this_cpu_add_2'
2019/11/16 17:44:59 akmodsbuild: 379 |   case 2: stem##2(variable, __VA_ARGS__);break;        |           ^~~~
2019/11/16 17:44:59 akmodsbuild: ./include/linux/percpu-defs.h:510:33: note: in expansion of macro '__pcpu_size_call'
2019/11/16 17:44:59 akmodsbuild: 510 | #define this_cpu_add(pcp, val)  __pcpu_size_call(this_cpu_add_, pcp, val)
2019/11/16 17:44:59 akmodsbuild: |                                 ^~~~~~~~~~~~~~~~
2019/11/16 17:44:59 akmodsbuild: ./include/linux/percpu-defs.h:520:33: note: in expansion of macro 'this_cpu_add'
2019/11/16 17:44:59 akmodsbuild: 520 | #define this_cpu_sub(pcp, val)  this_cpu_add(pcp, -(typeof(pcp))(val))
2019/11/16 17:44:59 akmodsbuild: |                                 ^~~~~~~~~~~~
2019/11/16 17:44:59 akmodsbuild: ./include/linux/percpu-refcount.h:291:3: note: in expansion of macro 'this_cpu_sub'
2019/11/16 17:44:59 akmodsbuild: 291 |   this_cpu_sub(*percpu_count, nr);
2019/11/16 17:44:59 akmodsbuild: |   ^~~~~~~~~~~~
2019/11/16 17:44:59 akmodsbuild: ./arch/x86/include/asm/percpu.h:131:31: warning: comparison of integer expressions of different signedness: 'long unsigned int' and 'int' [-Wsign-compare]
2019/11/16 17:44:59 akmodsbuild: 131 |          ((val) == 1 || (val) == -1)) ?        |                               ^~
2019/11/16 17:44:59 akmodsbuild: ./arch/x86/include/asm/percpu.h:434:34: note: in expansion of macro 'percpu_add_op'
2019/11/16 17:44:59 akmodsbuild: 434 | #define this_cpu_add_4(pcp, val) percpu_add_op(volatile, (pcp), val)
2019/11/16 17:44:59 akmodsbuild: |                                  ^~~~~~~~~~~~~
2019/11/16 17:44:59 akmodsbuild: ./include/linux/percpu-defs.h:380:11: note: in expansion of macro 'this_cpu_add_4'
2019/11/16 17:44:59 akmodsbuild: 380 |   case 4: stem##4(variable, __VA_ARGS__);break;        |           ^~~~
2019/11/16 17:44:59 akmodsbuild: ./include/linux/percpu-defs.h:510:33: note: in expansion of macro '__pcpu_size_call'
2019/11/16 17:44:59 akmodsbuild: 510 | #define this_cpu_add(pcp, val)  __pcpu_size_call(this_cpu_add_, pcp, val)
2019/11/16 17:44:59 akmodsbuild: |                                 ^~~~~~~~~~~~~~~~
2019/11/16 17:44:59 akmodsbuild: ./include/linux/percpu-defs.h:520:33: note: in expansion of macro 'this_cpu_add'
2019/11/16 17:44:59 akmodsbuild: 520 | #define this_cpu_sub(pcp, val)  this_cpu_add(pcp, -(typeof(pcp))(val))
2019/11/16 17:44:59 akmodsbuild: |                                 ^~~~~~~~~~~~
2019/11/16 17:44:59 akmodsbuild: ./include/linux/percpu-refcount.h:291:3: note: in expansion of macro 'this_cpu_sub'
2019/11/16 17:44:59 akmodsbuild: 291 |   this_cpu_sub(*percpu_count, nr);
2019/11/16 17:44:59 akmodsbuild: |   ^~~~~~~~~~~~
2019/11/16 17:44:59 akmodsbuild: ./arch/x86/include/asm/percpu.h:131:31: warning: comparison of integer expressions of different signedness: 'long unsigned int' and 'int' [-Wsign-compare]
2019/11/16 17:44:59 akmodsbuild: 131 |          ((val) == 1 || (val) == -1)) ?        |                               ^~
2019/11/16 17:44:59 akmodsbuild: ./arch/x86/include/asm/percpu.h:492:35: note: in expansion of macro 'percpu_add_op'
2019/11/16 17:44:59 akmodsbuild: 492 | #define this_cpu_add_8(pcp, val)  percpu_add_op(volatile, (pcp), val)
2019/11/16 17:44:59 akmodsbuild: |                                   ^~~~~~~~~~~~~
2019/11/16 17:44:59 akmodsbuild: ./include/linux/percpu-defs.h:381:11: note: in expansion of macro 'this_cpu_add_8'
2019/11/16 17:44:59 akmodsbuild: 381 |   case 8: stem##8(variable, __VA_ARGS__);break;        |           ^~~~
2019/11/16 17:44:59 akmodsbuild: ./include/linux/percpu-defs.h:510:33: note: in expansion of macro '__pcpu_size_call'
2019/11/16 17:44:59 akmodsbuild: 510 | #define this_cpu_add(pcp, val)  __pcpu_size_call(this_cpu_add_, pcp, val)
2019/11/16 17:44:59 akmodsbuild: |                                 ^~~~~~~~~~~~~~~~
2019/11/16 17:44:59 akmodsbuild: ./include/linux/percpu-defs.h:520:33: note: in expansion of macro 'this_cpu_add'
2019/11/16 17:44:59 akmodsbuild: 520 | #define this_cpu_sub(pcp, val)  this_cpu_add(pcp, -(typeof(pcp))(val))
2019/11/16 17:44:59 akmodsbuild: |                                 ^~~~~~~~~~~~
2019/11/16 17:44:59 akmodsbuild: ./include/linux/percpu-refcount.h:291:3: note: in expansion of macro 'this_cpu_sub'
2019/11/16 17:44:59 akmodsbuild: 291 |   this_cpu_sub(*percpu_count, nr);
2019/11/16 17:44:59 akmodsbuild: |   ^~~~~~~~~~~~
2019/11/16 17:44:59 akmodsbuild: In file included from ./arch/x86/include/asm/current.h:6,
2019/11/16 17:44:59 akmodsbuild: from ./include/linux/sched.h:12,
2019/11/16 17:44:59 akmodsbuild: from ./include/linux/utsname.h:6,
2019/11/16 17:44:59 akmodsbuild: from /tmp/akmodsbuild.BDZemvCW/BUILD/nvidia-340xx-kmod-340.107/_kmod_build_5.3.11-200.fc30.x86_64/nv-linux.h:44,
2019/11/16 17:44:59 akmodsbuild: from /tmp/akmodsbuild.BDZemvCW/BUILD/nvidia-340xx-kmod-340.107/_kmod_build_5.3.11-200.fc30.x86_64/nv-dma.c:15:
2019/11/16 17:44:59 akmodsbuild: ./include/linux/percpu-refcount.h: In function 'percpu_ref_get_many':
2019/11/16 17:44:59 akmodsbuild: ./arch/x86/include/asm/percpu.h:131:31: warning: comparison of integer expressions of different signedness: 'long unsigned int' and 'int' [-Wsign-compare]
2019/11/16 17:44:59 akmodsbuild: 131 |          ((val) == 1 || (val) == -1)) ?        |                               ^~
2019/11/16 17:44:59 akmodsbuild: ./arch/x86/include/asm/percpu.h:432:34: note: in expansion of macro 'percpu_add_op'
2019/11/16 17:44:59 akmodsbuild: 432 | #define this_cpu_add_1(pcp, val) percpu_add_op(volatile, (pcp), val)
2019/11/16 17:44:59 akmodsbuild: |                                  ^~~~~~~~~~~~~
2019/11/16 17:44:59 akmodsbuild: ./include/linux/percpu-defs.h:378:11: note: in expansion of macro 'this_cpu_add_1'
2019/11/16 17:44:59 akmodsbuild: 378 |   case 1: stem##1(variable, __VA_ARGS__);break;        |           ^~~~
2019/11/16 17:44:59 akmodsbuild: ./include/linux/percpu-defs.h:510:33: note: in expansion of macro '__pcpu_size_call'
2019/11/16 17:44:59 akmodsbuild: 510 | #define this_cpu_add(pcp, val)  __pcpu_size_call(this_cpu_add_, pcp, val)
2019/11/16 17:44:59 akmodsbuild: |                                 ^~~~~~~~~~~~~~~~
2019/11/16 17:44:59 akmodsbuild: ./include/linux/percpu-refcount.h:192:3: note: in expansion of macro 'this_cpu_add'
2019/11/16 17:44:59 akmodsbuild: 192 |   this_cpu_add(*percpu_count, nr);
2019/11/16 17:44:59 akmodsbuild: |   ^~~~~~~~~~~~
2019/11/16 17:44:59 akmodsbuild: ./arch/x86/include/asm/percpu.h:131:31: warning: comparison of integer expressions of different signedness: 'long unsigned int' and 'int' [-Wsign-compare]
2019/11/16 17:44:59 akmodsbuild: 131 |          ((val) == 1 || (val) == -1)) ?        |                               ^~
2019/11/16 17:44:59 akmodsbuild: ./arch/x86/include/asm/percpu.h:433:34: note: in expansion of macro 'percpu_add_op'
2019/11/16 17:44:59 akmodsbuild: 433 | #define this_cpu_add_2(pcp, val) percpu_add_op(volatile, (pcp), val)
2019/11/16 17:44:59 akmodsbuild: |                                  ^~~~~~~~~~~~~
2019/11/16 17:44:59 akmodsbuild: ./include/linux/percpu-defs.h:379:11: note: in expansion of macro 'this_cpu_add_2'
2019/11/16 17:44:59 akmodsbuild: 379 |   case 2: stem##2(variable, __VA_ARGS__);break;        |           ^~~~
2019/11/16 17:44:59 akmodsbuild: ./include/linux/percpu-defs.h:510:33: note: in expansion of macro '__pcpu_size_call'
2019/11/16 17:44:59 akmodsbuild: 510 | #define this_cpu_add(pcp, val)  __pcpu_size_call(this_cpu_add_, pcp, val)
2019/11/16 17:44:59 akmodsbuild: |                                 ^~~~~~~~~~~~~~~~
2019/11/16 17:44:59 akmodsbuild: ./include/linux/percpu-refcount.h:192:3: note: in expansion of macro 'this_cpu_add'
2019/11/16 17:44:59 akmodsbuild: 192 |   this_cpu_add(*percpu_count, nr);
2019/11/16 17:44:59 akmodsbuild: |   ^~~~~~~~~~~~
2019/11/16 17:44:59 akmodsbuild: ./arch/x86/include/asm/percpu.h:131:31: warning: comparison of integer expressions of different signedness: 'long unsigned int' and 'int' [-Wsign-compare]
2019/11/16 17:44:59 akmodsbuild: 131 |          ((val) == 1 || (val) == -1)) ?        |                               ^~
2019/11/16 17:44:59 akmodsbuild: ./arch/x86/include/asm/percpu.h:434:34: note: in expansion of macro 'percpu_add_op'
2019/11/16 17:44:59 akmodsbuild: 434 | #define this_cpu_add_4(pcp, val) percpu_add_op(volatile, (pcp), val)
2019/11/16 17:44:59 akmodsbuild: |                                  ^~~~~~~~~~~~~
2019/11/16 17:44:59 akmodsbuild: ./include/linux/percpu-defs.h:380:11: note: in expansion of macro 'this_cpu_add_4'
2019/11/16 17:44:59 akmodsbuild: 380 |   case 4: stem##4(variable, __VA_ARGS__);break;        |           ^~~~
2019/11/16 17:44:59 akmodsbuild: ./include/linux/percpu-defs.h:510:33: note: in expansion of macro '__pcpu_size_call'
2019/11/16 17:44:59 akmodsbuild: 510 | #define this_cpu_add(pcp, val)  __pcpu_size_call(this_cpu_add_, pcp, val)
2019/11/16 17:44:59 akmodsbuild: |                                 ^~~~~~~~~~~~~~~~
2019/11/16 17:44:59 akmodsbuild: ./include/linux/percpu-refcount.h:192:3: note: in expansion of macro 'this_cpu_add'
2019/11/16 17:44:59 akmodsbuild: 192 |   this_cpu_add(*percpu_count, nr);
2019/11/16 17:44:59 akmodsbuild: |   ^~~~~~~~~~~~
2019/11/16 17:44:59 akmodsbuild: ./arch/x86/include/asm/percpu.h:131:31: warning: comparison of integer expressions of different signedness: 'long unsigned int' and 'int' [-Wsign-compare]
2019/11/16 17:44:59 akmodsbuild: 131 |          ((val) == 1 || (val) == -1)) ?        |                               ^~
2019/11/16 17:44:59 akmodsbuild: ./arch/x86/include/asm/percpu.h:492:35: note: in expansion of macro 'percpu_add_op'
2019/11/16 17:44:59 akmodsbuild: 492 | #define this_cpu_add_8(pcp, val)  percpu_add_op(volatile, (pcp), val)
2019/11/16 17:44:59 akmodsbuild: |                                   ^~~~~~~~~~~~~
2019/11/16 17:44:59 akmodsbuild: ./include/linux/percpu-defs.h:381:11: note: in expansion of macro 'this_cpu_add_8'
2019/11/16 17:44:59 akmodsbuild: 381 |   case 8: stem##8(variable, __VA_ARGS__);break;        |           ^~~~
2019/11/16 17:44:59 akmodsbuild: ./include/linux/percpu-defs.h:510:33: note: in expansion of macro '__pcpu_size_call'
2019/11/16 17:44:59 akmodsbuild: 510 | #define this_cpu_add(pcp, val)  __pcpu_size_call(this_cpu_add_, pcp, val)
2019/11/16 17:44:59 akmodsbuild: |                                 ^~~~~~~~~~~~~~~~
2019/11/16 17:44:59 akmodsbuild: ./include/linux/percpu-refcount.h:192:3: note: in expansion of macro 'this_cpu_add'
2019/11/16 17:44:59 akmodsbuild: 192 |   this_cpu_add(*percpu_count, nr);
2019/11/16 17:44:59 akmodsbuild: |   ^~~~~~~~~~~~
2019/11/16 17:44:59 akmodsbuild: ./include/linux/percpu-refcount.h: In function 'percpu_ref_put_many':
2019/11/16 17:44:59 akmodsbuild: ./arch/x86/include/asm/percpu.h:131:31: warning: comparison of integer expressions of different signedness: 'long unsigned int' and 'int' [-Wsign-compare]
2019/11/16 17:44:59 akmodsbuild: 131 |          ((val) == 1 || (val) == -1)) ?        |                               ^~
2019/11/16 17:44:59 akmodsbuild: ./arch/x86/include/asm/percpu.h:432:34: note: in expansion of macro 'percpu_add_op'
2019/11/16 17:44:59 akmodsbuild: 432 | #define this_cpu_add_1(pcp, val) percpu_add_op(volatile, (pcp), val)
2019/11/16 17:44:59 akmodsbuild: |                                  ^~~~~~~~~~~~~
2019/11/16 17:44:59 akmodsbuild: ./include/linux/percpu-defs.h:378:11: note: in expansion of macro 'this_cpu_add_1'
2019/11/16 17:44:59 akmodsbuild: 378 |   case 1: stem##1(variable, __VA_ARGS__);break;        |           ^~~~
2019/11/16 17:44:59 akmodsbuild: ./include/linux/percpu-defs.h:510:33: note: in expansion of macro '__pcpu_size_call'
2019/11/16 17:44:59 akmodsbuild: 510 | #define this_cpu_add(pcp, val)  __pcpu_size_call(this_cpu_add_, pcp, val)
2019/11/16 17:44:59 akmodsbuild: |                                 ^~~~~~~~~~~~~~~~
2019/11/16 17:44:59 akmodsbuild: ./include/linux/percpu-defs.h:520:33: note: in expansion of macro 'this_cpu_add'
2019/11/16 17:44:59 akmodsbuild: 520 | #define this_cpu_sub(pcp, val)  this_cpu_add(pcp, -(typeof(pcp))(val))
2019/11/16 17:44:59 akmodsbuild: |                                 ^~~~~~~~~~~~
2019/11/16 17:44:59 akmodsbuild: ./include/linux/percpu-refcount.h:291:3: note: in expansion of macro 'this_cpu_sub'
2019/11/16 17:44:59 akmodsbuild: 291 |   this_cpu_sub(*percpu_count, nr);
2019/11/16 17:44:59 akmodsbuild: |   ^~~~~~~~~~~~
2019/11/16 17:44:59 akmodsbuild: ./arch/x86/include/asm/percpu.h:131:31: warning: comparison of integer expressions of different signedness: 'long unsigned int' and 'int' [-Wsign-compare]
2019/11/16 17:44:59 akmodsbuild: 131 |          ((val) == 1 || (val) == -1)) ?        |                               ^~
2019/11/16 17:44:59 akmodsbuild: ./arch/x86/include/asm/percpu.h:433:34: note: in expansion of macro 'percpu_add_op'
2019/11/16 17:44:59 akmodsbuild: 433 | #define this_cpu_add_2(pcp, val) percpu_add_op(volatile, (pcp), val)
2019/11/16 17:44:59 akmodsbuild: |                                  ^~~~~~~~~~~~~
2019/11/16 17:44:59 akmodsbuild: ./include/linux/percpu-defs.h:379:11: note: in expansion of macro 'this_cpu_add_2'
2019/11/16 17:44:59 akmodsbuild: 379 |   case 2: stem##2(variable, __VA_ARGS__);break;        |           ^~~~
2019/11/16 17:44:59 akmodsbuild: ./include/linux/percpu-defs.h:510:33: note: in expansion of macro '__pcpu_size_call'
2019/11/16 17:44:59 akmodsbuild: 510 | #define this_cpu_add(pcp, val)  __pcpu_size_call(this_cpu_add_, pcp, val)
2019/11/16 17:44:59 akmodsbuild: |                                 ^~~~~~~~~~~~~~~~
2019/11/16 17:44:59 akmodsbuild: ./include/linux/percpu-defs.h:520:33: note: in expansion of macro 'this_cpu_add'
2019/11/16 17:44:59 akmodsbuild: 520 | #define this_cpu_sub(pcp, val)  this_cpu_add(pcp, -(typeof(pcp))(val))
2019/11/16 17:44:59 akmodsbuild: |                                 ^~~~~~~~~~~~
2019/11/16 17:44:59 akmodsbuild: ./include/linux/percpu-refcount.h:291:3: note: in expansion of macro 'this_cpu_sub'
2019/11/16 17:44:59 akmodsbuild: 291 |   this_cpu_sub(*percpu_count, nr);
2019/11/16 17:44:59 akmodsbuild: |   ^~~~~~~~~~~~
2019/11/16 17:44:59 akmodsbuild: In file included from ./arch/x86/include/asm/current.h:6,
2019/11/16 17:44:59 akmodsbuild: from ./include/linux/sched.h:12,
2019/11/16 17:44:59 akmodsbuild: from ./include/linux/utsname.h:6,
2019/11/16 17:44:59 akmodsbuild: from /tmp/akmodsbuild.BDZemvCW/BUILD/nvidia-340xx-kmod-340.107/_kmod_build_5.3.11-200.fc30.x86_64/nv-linux.h:44,
2019/11/16 17:44:59 akmodsbuild: from /tmp/akmodsbuild.BDZemvCW/BUILD/nvidia-340xx-kmod-340.107/_kmod_build_5.3.11-200.fc30.x86_64/nv-acpi.c:15:
2019/11/16 17:44:59 akmodsbuild: ./include/linux/percpu-refcount.h: In function 'percpu_ref_get_many':
2019/11/16 17:44:59 akmodsbuild: ./arch/x86/include/asm/percpu.h:131:31: warning: comparison of integer expressions of different signedness: 'long unsigned int' and 'int' [-Wsign-compare]
2019/11/16 17:44:59 akmodsbuild: 131 |          ((val) == 1 || (val) == -1)) ?        |                               ^~
2019/11/16 17:44:59 akmodsbuild: ./arch/x86/include/asm/percpu.h:432:34: note: in expansion of macro 'percpu_add_op'
2019/11/16 17:44:59 akmodsbuild: 432 | #define this_cpu_add_1(pcp, val) percpu_add_op(volatile, (pcp), val)
2019/11/16 17:44:59 akmodsbuild: |                                  ^~~~~~~~~~~~~
2019/11/16 17:44:59 akmodsbuild: ./include/linux/percpu-defs.h:378:11: note: in expansion of macro 'this_cpu_add_1'
2019/11/16 17:44:59 akmodsbuild: 378 |   case 1: stem##1(variable, __VA_ARGS__);break;        |           ^~~~
2019/11/16 17:44:59 akmodsbuild: ./include/linux/percpu-defs.h:510:33: note: in expansion of macro '__pcpu_size_call'
2019/11/16 17:44:59 akmodsbuild: 510 | #define this_cpu_add(pcp, val)  __pcpu_size_call(this_cpu_add_, pcp, val)
2019/11/16 17:44:59 akmodsbuild: |                                 ^~~~~~~~~~~~~~~~
2019/11/16 17:44:59 akmodsbuild: ./include/linux/percpu-refcount.h:192:3: note: in expansion of macro 'this_cpu_add'
2019/11/16 17:44:59 akmodsbuild: 192 |   this_cpu_add(*percpu_count, nr);
2019/11/16 17:44:59 akmodsbuild: |   ^~~~~~~~~~~~
2019/11/16 17:44:59 akmodsbuild: ./arch/x86/include/asm/percpu.h:131:31: warning: comparison of integer expressions of different signedness: 'long unsigned int' and 'int' [-Wsign-compare]
2019/11/16 17:44:59 akmodsbuild: 131 |          ((val) == 1 || (val) == -1)) ?        |                               ^~
2019/11/16 17:44:59 akmodsbuild: ./arch/x86/include/asm/percpu.h:434:34: note: in expansion of macro 'percpu_add_op'
2019/11/16 17:44:59 akmodsbuild: 434 | #define this_cpu_add_4(pcp, val) percpu_add_op(volatile, (pcp), val)
2019/11/16 17:44:59 akmodsbuild: |                                  ^~~~~~~~~~~~~
2019/11/16 17:44:59 akmodsbuild: ./include/linux/percpu-defs.h:380:11: note: in expansion of macro 'this_cpu_add_4'
2019/11/16 17:44:59 akmodsbuild: 380 |   case 4: stem##4(variable, __VA_ARGS__);break;        |           ^~~~
2019/11/16 17:44:59 akmodsbuild: ./include/linux/percpu-defs.h:510:33: note: in expansion of macro '__pcpu_size_call'
2019/11/16 17:44:59 akmodsbuild: 510 | #define this_cpu_add(pcp, val)  __pcpu_size_call(this_cpu_add_, pcp, val)
2019/11/16 17:44:59 akmodsbuild: |                                 ^~~~~~~~~~~~~~~~
2019/11/16 17:44:59 akmodsbuild: ./include/linux/percpu-defs.h:520:33: note: in expansion of macro 'this_cpu_add'
2019/11/16 17:44:59 akmodsbuild: 520 | #define this_cpu_sub(pcp, val)  this_cpu_add(pcp, -(typeof(pcp))(val))
2019/11/16 17:44:59 akmodsbuild: |                                 ^~~~~~~~~~~~
2019/11/16 17:44:59 akmodsbuild: ./include/linux/percpu-refcount.h:291:3: note: in expansion of macro 'this_cpu_sub'
2019/11/16 17:44:59 akmodsbuild: 291 |   this_cpu_sub(*percpu_count, nr);
2019/11/16 17:44:59 akmodsbuild: |   ^~~~~~~~~~~~
2019/11/16 17:44:59 akmodsbuild: ./arch/x86/include/asm/percpu.h:131:31: warning: comparison of integer expressions of different signedness: 'long unsigned int' and 'int' [-Wsign-compare]
2019/11/16 17:44:59 akmodsbuild: 131 |          ((val) == 1 || (val) == -1)) ?        |                               ^~
2019/11/16 17:44:59 akmodsbuild: ./arch/x86/include/asm/percpu.h:433:34: note: in expansion of macro 'percpu_add_op'
2019/11/16 17:44:59 akmodsbuild: 433 | #define this_cpu_add_2(pcp, val) percpu_add_op(volatile, (pcp), val)
2019/11/16 17:44:59 akmodsbuild: |                                  ^~~~~~~~~~~~~
2019/11/16 17:44:59 akmodsbuild: ./include/linux/percpu-defs.h:379:11: note: in expansion of macro 'this_cpu_add_2'
2019/11/16 17:44:59 akmodsbuild: 379 |   case 2: stem##2(variable, __VA_ARGS__);break;        |           ^~~~
2019/11/16 17:44:59 akmodsbuild: ./include/linux/percpu-defs.h:510:33: note: in expansion of macro '__pcpu_size_call'
2019/11/16 17:44:59 akmodsbuild: 510 | #define this_cpu_add(pcp, val)  __pcpu_size_call(this_cpu_add_, pcp, val)
2019/11/16 17:44:59 akmodsbuild: |                                 ^~~~~~~~~~~~~~~~
2019/11/16 17:44:59 akmodsbuild: ./include/linux/percpu-refcount.h:192:3: note: in expansion of macro 'this_cpu_add'
2019/11/16 17:44:59 akmodsbuild: 192 |   this_cpu_add(*percpu_count, nr);
2019/11/16 17:44:59 akmodsbuild: |   ^~~~~~~~~~~~
2019/11/16 17:44:59 akmodsbuild: ./arch/x86/include/asm/percpu.h:131:31: warning: comparison of integer expressions of different signedness: 'long unsigned int' and 'int' [-Wsign-compare]
2019/11/16 17:44:59 akmodsbuild: 131 |          ((val) == 1 || (val) == -1)) ?        |                               ^~
2019/11/16 17:44:59 akmodsbuild: ./arch/x86/include/asm/percpu.h:492:35: note: in expansion of macro 'percpu_add_op'
2019/11/16 17:44:59 akmodsbuild: 492 | #define this_cpu_add_8(pcp, val)  percpu_add_op(volatile, (pcp), val)
2019/11/16 17:44:59 akmodsbuild: |                                   ^~~~~~~~~~~~~
2019/11/16 17:44:59 akmodsbuild: ./include/linux/percpu-defs.h:381:11: note: in expansion of macro 'this_cpu_add_8'
2019/11/16 17:44:59 akmodsbuild: 381 |   case 8: stem##8(variable, __VA_ARGS__);break;        |           ^~~~
2019/11/16 17:44:59 akmodsbuild: ./include/linux/percpu-defs.h:510:33: note: in expansion of macro '__pcpu_size_call'
2019/11/16 17:44:59 akmodsbuild: 510 | #define this_cpu_add(pcp, val)  __pcpu_size_call(this_cpu_add_, pcp, val)
2019/11/16 17:44:59 akmodsbuild: |                                 ^~~~~~~~~~~~~~~~
2019/11/16 17:44:59 akmodsbuild: ./include/linux/percpu-defs.h:520:33: note: in expansion of macro 'this_cpu_add'
2019/11/16 17:44:59 akmodsbuild: 520 | #define this_cpu_sub(pcp, val)  this_cpu_add(pcp, -(typeof(pcp))(val))
2019/11/16 17:44:59 akmodsbuild: |                                 ^~~~~~~~~~~~
2019/11/16 17:44:59 akmodsbuild: ./include/linux/percpu-refcount.h:291:3: note: in expansion of macro 'this_cpu_sub'
2019/11/16 17:44:59 akmodsbuild: 291 |   this_cpu_sub(*percpu_count, nr);
2019/11/16 17:44:59 akmodsbuild: |   ^~~~~~~~~~~~
2019/11/16 17:44:59 akmodsbuild: ./arch/x86/include/asm/percpu.h:131:31: warning: comparison of integer expressions of different signedness: 'long unsigned int' and 'int' [-Wsign-compare]
2019/11/16 17:44:59 akmodsbuild: 131 |          ((val) == 1 || (val) == -1)) ?        |                               ^~
2019/11/16 17:44:59 akmodsbuild: ./arch/x86/include/asm/percpu.h:434:34: note: in expansion of macro 'percpu_add_op'
2019/11/16 17:44:59 akmodsbuild: 434 | #define this_cpu_add_4(pcp, val) percpu_add_op(volatile, (pcp), val)
2019/11/16 17:44:59 akmodsbuild: |                                  ^~~~~~~~~~~~~
2019/11/16 17:44:59 akmodsbuild: ./include/linux/percpu-defs.h:380:11: note: in expansion of macro 'this_cpu_add_4'
2019/11/16 17:44:59 akmodsbuild: 380 |   case 4: stem##4(variable, __VA_ARGS__);break;        |           ^~~~
2019/11/16 17:44:59 akmodsbuild: ./include/linux/percpu-defs.h:510:33: note: in expansion of macro '__pcpu_size_call'
2019/11/16 17:44:59 akmodsbuild: 510 | #define this_cpu_add(pcp, val)  __pcpu_size_call(this_cpu_add_, pcp, val)
2019/11/16 17:44:59 akmodsbuild: |                                 ^~~~~~~~~~~~~~~~
2019/11/16 17:44:59 akmodsbuild: ./include/linux/percpu-refcount.h:192:3: note: in expansion of macro 'this_cpu_add'
2019/11/16 17:44:59 akmodsbuild: 192 |   this_cpu_add(*percpu_count, nr);
2019/11/16 17:44:59 akmodsbuild: |   ^~~~~~~~~~~~
2019/11/16 17:44:59 akmodsbuild: ./arch/x86/include/asm/percpu.h:131:31: warning: comparison of integer expressions of different signedness: 'long unsigned int' and 'int' [-Wsign-compare]
2019/11/16 17:44:59 akmodsbuild: 131 |          ((val) == 1 || (val) == -1)) ?        |                               ^~
2019/11/16 17:44:59 akmodsbuild: ./arch/x86/include/asm/percpu.h:492:35: note: in expansion of macro 'percpu_add_op'
2019/11/16 17:44:59 akmodsbuild: 492 | #define this_cpu_add_8(pcp, val)  percpu_add_op(volatile, (pcp), val)
2019/11/16 17:44:59 akmodsbuild: |                                   ^~~~~~~~~~~~~
2019/11/16 17:44:59 akmodsbuild: ./include/linux/percpu-defs.h:381:11: note: in expansion of macro 'this_cpu_add_8'
2019/11/16 17:44:59 akmodsbuild: 381 |   case 8: stem##8(variable, __VA_ARGS__);break;        |           ^~~~
2019/11/16 17:44:59 akmodsbuild: ./include/linux/percpu-defs.h:510:33: note: in expansion of macro '__pcpu_size_call'
2019/11/16 17:44:59 akmodsbuild: 510 | #define this_cpu_add(pcp, val)  __pcpu_size_call(this_cpu_add_, pcp, val)
2019/11/16 17:44:59 akmodsbuild: |                                 ^~~~~~~~~~~~~~~~
2019/11/16 17:44:59 akmodsbuild: ./include/linux/percpu-refcount.h:192:3: note: in expansion of macro 'this_cpu_add'
2019/11/16 17:45:00 akmodsbuild: 192 |   this_cpu_add(*percpu_count, nr);
2019/11/16 17:45:00 akmodsbuild: |   ^~~~~~~~~~~~
2019/11/16 17:45:00 akmodsbuild: ./include/linux/percpu-refcount.h: In function 'percpu_ref_put_many':
2019/11/16 17:45:00 akmodsbuild: ./arch/x86/include/asm/percpu.h:131:31: warning: comparison of integer expressions of different signedness: 'long unsigned int' and 'int' [-Wsign-compare]
2019/11/16 17:45:00 akmodsbuild: 131 |          ((val) == 1 || (val) == -1)) ?        |                               ^~
2019/11/16 17:45:00 akmodsbuild: ./arch/x86/include/asm/percpu.h:432:34: note: in expansion of macro 'percpu_add_op'
2019/11/16 17:45:00 akmodsbuild: 432 | #define this_cpu_add_1(pcp, val) percpu_add_op(volatile, (pcp), val)
2019/11/16 17:45:00 akmodsbuild: |                                  ^~~~~~~~~~~~~
2019/11/16 17:45:00 akmodsbuild: ./include/linux/percpu-defs.h:378:11: note: in expansion of macro 'this_cpu_add_1'
2019/11/16 17:45:00 akmodsbuild: 378 |   case 1: stem##1(variable, __VA_ARGS__);break;        |           ^~~~
2019/11/16 17:45:00 akmodsbuild: ./include/linux/percpu-defs.h:510:33: note: in expansion of macro '__pcpu_size_call'
2019/11/16 17:45:00 akmodsbuild: 510 | #define this_cpu_add(pcp, val)  __pcpu_size_call(this_cpu_add_, pcp, val)
2019/11/16 17:45:00 akmodsbuild: |                                 ^~~~~~~~~~~~~~~~
2019/11/16 17:45:00 akmodsbuild: ./include/linux/percpu-defs.h:520:33: note: in expansion of macro 'this_cpu_add'
2019/11/16 17:45:00 akmodsbuild: 520 | #define this_cpu_sub(pcp, val)  this_cpu_add(pcp, -(typeof(pcp))(val))
2019/11/16 17:45:00 akmodsbuild: |                                 ^~~~~~~~~~~~
2019/11/16 17:45:00 akmodsbuild: ./include/linux/percpu-refcount.h:291:3: note: in expansion of macro 'this_cpu_sub'
2019/11/16 17:45:00 akmodsbuild: 291 |   this_cpu_sub(*percpu_count, nr);
2019/11/16 17:45:00 akmodsbuild: |   ^~~~~~~~~~~~
2019/11/16 17:45:00 akmodsbuild: ./arch/x86/include/asm/percpu.h:131:31: warning: comparison of integer expressions of different signedness: 'long unsigned int' and 'int' [-Wsign-compare]
2019/11/16 17:45:00 akmodsbuild: 131 |          ((val) == 1 || (val) == -1)) ?        |                               ^~
2019/11/16 17:45:00 akmodsbuild: ./arch/x86/include/asm/percpu.h:433:34: note: in expansion of macro 'percpu_add_op'
2019/11/16 17:45:00 akmodsbuild: 433 | #define this_cpu_add_2(pcp, val) percpu_add_op(volatile, (pcp), val)
2019/11/16 17:45:00 akmodsbuild: |                                  ^~~~~~~~~~~~~
2019/11/16 17:45:00 akmodsbuild: ./include/linux/percpu-defs.h:379:11: note: in expansion of macro 'this_cpu_add_2'
2019/11/16 17:45:00 akmodsbuild: 379 |   case 2: stem##2(variable, __VA_ARGS__);break;        |           ^~~~
2019/11/16 17:45:00 akmodsbuild: ./include/linux/percpu-defs.h:510:33: note: in expansion of macro '__pcpu_size_call'
2019/11/16 17:45:00 akmodsbuild: 510 | #define this_cpu_add(pcp, val)  __pcpu_size_call(this_cpu_add_, pcp, val)
2019/11/16 17:45:00 akmodsbuild: |                                 ^~~~~~~~~~~~~~~~
2019/11/16 17:45:00 akmodsbuild: ./include/linux/percpu-defs.h:520:33: note: in expansion of macro 'this_cpu_add'
2019/11/16 17:45:00 akmodsbuild: 520 | #define this_cpu_sub(pcp, val)  this_cpu_add(pcp, -(typeof(pcp))(val))
2019/11/16 17:45:00 akmodsbuild: |                                 ^~~~~~~~~~~~
2019/11/16 17:45:00 akmodsbuild: ./include/linux/percpu-refcount.h:291:3: note: in expansion of macro 'this_cpu_sub'
2019/11/16 17:45:00 akmodsbuild: 291 |   this_cpu_sub(*percpu_count, nr);
2019/11/16 17:45:00 akmodsbuild: |   ^~~~~~~~~~~~
2019/11/16 17:45:00 akmodsbuild: ./arch/x86/include/asm/percpu.h:131:31: warning: comparison of integer expressions of different signedness: 'long unsigned int' and 'int' [-Wsign-compare]
2019/11/16 17:45:00 akmodsbuild: 131 |          ((val) == 1 || (val) == -1)) ?        |                               ^~
2019/11/16 17:45:00 akmodsbuild: ./arch/x86/include/asm/percpu.h:434:34: note: in expansion of macro 'percpu_add_op'
2019/11/16 17:45:00 akmodsbuild: 434 | #define this_cpu_add_4(pcp, val) percpu_add_op(volatile, (pcp), val)
2019/11/16 17:45:00 akmodsbuild: |                                  ^~~~~~~~~~~~~
2019/11/16 17:45:00 akmodsbuild: ./include/linux/percpu-defs.h:380:11: note: in expansion of macro 'this_cpu_add_4'
2019/11/16 17:45:00 akmodsbuild: 380 |   case 4: stem##4(variable, __VA_ARGS__);break;        |           ^~~~
2019/11/16 17:45:00 akmodsbuild: ./include/linux/percpu-defs.h:510:33: note: in expansion of macro '__pcpu_size_call'
2019/11/16 17:45:00 akmodsbuild: 510 | #define this_cpu_add(pcp, val)  __pcpu_size_call(this_cpu_add_, pcp, val)
2019/11/16 17:45:00 akmodsbuild: |                                 ^~~~~~~~~~~~~~~~
2019/11/16 17:45:00 akmodsbuild: ./include/linux/percpu-defs.h:520:33: note: in expansion of macro 'this_cpu_add'
2019/11/16 17:45:00 akmodsbuild: 520 | #define this_cpu_sub(pcp, val)  this_cpu_add(pcp, -(typeof(pcp))(val))
2019/11/16 17:45:00 akmodsbuild: |                                 ^~~~~~~~~~~~
2019/11/16 17:45:00 akmodsbuild: ./include/linux/percpu-refcount.h:291:3: note: in expansion of macro 'this_cpu_sub'
2019/11/16 17:45:00 akmodsbuild: 291 |   this_cpu_sub(*percpu_count, nr);
2019/11/16 17:45:00 akmodsbuild: |   ^~~~~~~~~~~~
2019/11/16 17:45:00 akmodsbuild: ./arch/x86/include/asm/percpu.h:131:31: warning: comparison of integer expressions of different signedness: 'long unsigned int' and 'int' [-Wsign-compare]
2019/11/16 17:45:00 akmodsbuild: 131 |          ((val) == 1 || (val) == -1)) ?        |                               ^~
2019/11/16 17:45:00 akmodsbuild: ./arch/x86/include/asm/percpu.h:492:35: note: in expansion of macro 'percpu_add_op'
2019/11/16 17:45:00 akmodsbuild: 492 | #define this_cpu_add_8(pcp, val)  percpu_add_op(volatile, (pcp), val)
2019/11/16 17:45:00 akmodsbuild: |                                   ^~~~~~~~~~~~~
2019/11/16 17:45:00 akmodsbuild: ./include/linux/percpu-defs.h:381:11: note: in expansion of macro 'this_cpu_add_8'
2019/11/16 17:45:00 akmodsbuild: 381 |   case 8: stem##8(variable, __VA_ARGS__);break;        |           ^~~~
2019/11/16 17:45:00 akmodsbuild: ./include/linux/percpu-defs.h:510:33: note: in expansion of macro '__pcpu_size_call'
2019/11/16 17:45:00 akmodsbuild: 510 | #define this_cpu_add(pcp, val)  __pcpu_size_call(this_cpu_add_, pcp, val)
2019/11/16 17:45:00 akmodsbuild: |                                 ^~~~~~~~~~~~~~~~
2019/11/16 17:45:00 akmodsbuild: ./include/linux/percpu-defs.h:520:33: note: in expansion of macro 'this_cpu_add'
2019/11/16 17:45:00 akmodsbuild: 520 | #define this_cpu_sub(pcp, val)  this_cpu_add(pcp, -(typeof(pcp))(val))
2019/11/16 17:45:00 akmodsbuild: |                                 ^~~~~~~~~~~~
2019/11/16 17:45:00 akmodsbuild: ./include/linux/percpu-refcount.h:291:3: note: in expansion of macro 'this_cpu_sub'
2019/11/16 17:45:00 akmodsbuild: 291 |   this_cpu_sub(*percpu_count, nr);
2019/11/16 17:45:00 akmodsbuild: |   ^~~~~~~~~~~~
2019/11/16 17:45:00 akmodsbuild: ./include/linux/percpu-rwsem.h: In function 'percpu_up_read':
2019/11/16 17:45:00 akmodsbuild: ./arch/x86/include/asm/percpu.h:131:31: warning: comparison of integer expressions of different signedness: 'unsigned int' and 'int' [-Wsign-compare]
2019/11/16 17:45:00 akmodsbuild: 131 |          ((val) == 1 || (val) == -1)) ?        |                               ^~
2019/11/16 17:45:00 akmodsbuild: ./arch/x86/include/asm/percpu.h:401:34: note: in expansion of macro 'percpu_add_op'
2019/11/16 17:45:00 akmodsbuild: 401 | #define raw_cpu_add_1(pcp, val)  percpu_add_op(, (pcp), val)
2019/11/16 17:45:00 akmodsbuild: |                                  ^~~~~~~~~~~~~
2019/11/16 17:45:00 akmodsbuild: ./include/linux/percpu-defs.h:378:11: note: in expansion of macro 'raw_cpu_add_1'
2019/11/16 17:45:00 akmodsbuild: 378 |   case 1: stem##1(variable, __VA_ARGS__);break;        |           ^~~~
2019/11/16 17:45:00 akmodsbuild: ./include/linux/percpu-defs.h:423:32: note: in expansion of macro '__pcpu_size_call'
2019/11/16 17:45:00 akmodsbuild: 423 | #define raw_cpu_add(pcp, val)  __pcpu_size_call(raw_cpu_add_, pcp, val)
2019/11/16 17:45:00 akmodsbuild: |                                ^~~~~~~~~~~~~~~~
2019/11/16 17:45:00 akmodsbuild: ./include/linux/percpu-defs.h:459:2: note: in expansion of macro 'raw_cpu_add'
2019/11/16 17:45:00 akmodsbuild: 459 |  raw_cpu_add(pcp, val);            |  ^~~~~~~~~~~
2019/11/16 17:45:00 akmodsbuild: ./include/linux/percpu-defs.h:497:34: note: in expansion of macro '__this_cpu_add'
2019/11/16 17:45:00 akmodsbuild: 497 | #define __this_cpu_sub(pcp, val) __this_cpu_add(pcp, -(typeof(pcp))(val))
2019/11/16 17:45:00 akmodsbuild: |                                  ^~~~~~~~~~~~~~
2019/11/16 17:45:00 akmodsbuild: ./include/linux/percpu-defs.h:499:30: note: in expansion of macro '__this_cpu_sub'
2019/11/16 17:45:00 akmodsbuild: 499 | #define __this_cpu_dec(pcp)  __this_cpu_sub(pcp, 1)
2019/11/16 17:45:00 akmodsbuild: |                              ^~~~~~~~~~~~~~
2019/11/16 17:45:00 akmodsbuild: ./include/linux/percpu-rwsem.h:91:3: note: in expansion of macro '__this_cpu_dec'
2019/11/16 17:45:00 akmodsbuild: 91 |   __this_cpu_dec(*sem->read_count);
2019/11/16 17:45:00 akmodsbuild: |   ^~~~~~~~~~~~~~
2019/11/16 17:45:00 akmodsbuild: ./arch/x86/include/asm/percpu.h:131:31: warning: comparison of integer expressions of different signedness: 'unsigned int' and 'int' [-Wsign-compare]
2019/11/16 17:45:00 akmodsbuild: 131 |          ((val) == 1 || (val) == -1)) ?        |                               ^~
2019/11/16 17:45:00 akmodsbuild: ./arch/x86/include/asm/percpu.h:402:34: note: in expansion of macro 'percpu_add_op'
2019/11/16 17:45:00 akmodsbuild: 402 | #define raw_cpu_add_2(pcp, val)  percpu_add_op(, (pcp), val)
2019/11/16 17:45:00 akmodsbuild: |                                  ^~~~~~~~~~~~~
2019/11/16 17:45:00 akmodsbuild: ./include/linux/percpu-defs.h:379:11: note: in expansion of macro 'raw_cpu_add_2'
2019/11/16 17:45:00 akmodsbuild: 379 |   case 2: stem##2(variable, __VA_ARGS__);break;        |           ^~~~
2019/11/16 17:45:00 akmodsbuild: ./include/linux/percpu-defs.h:423:32: note: in expansion of macro '__pcpu_size_call'
2019/11/16 17:45:00 akmodsbuild: 423 | #define raw_cpu_add(pcp, val)  __pcpu_size_call(raw_cpu_add_, pcp, val)
2019/11/16 17:45:00 akmodsbuild: |                                ^~~~~~~~~~~~~~~~
2019/11/16 17:45:00 akmodsbuild: ./include/linux/percpu-defs.h:459:2: note: in expansion of macro 'raw_cpu_add'
2019/11/16 17:45:00 akmodsbuild: 459 |  raw_cpu_add(pcp, val);            |  ^~~~~~~~~~~
2019/11/16 17:45:00 akmodsbuild: ./include/linux/percpu-defs.h:497:34: note: in expansion of macro '__this_cpu_add'
2019/11/16 17:45:00 akmodsbuild: 497 | #define __this_cpu_sub(pcp, val) __this_cpu_add(pcp, -(typeof(pcp))(val))
2019/11/16 17:45:00 akmodsbuild: |                                  ^~~~~~~~~~~~~~
2019/11/16 17:45:00 akmodsbuild: ./include/linux/percpu-defs.h:499:30: note: in expansion of macro '__this_cpu_sub'
2019/11/16 17:45:00 akmodsbuild: 499 | #define __this_cpu_dec(pcp)  __this_cpu_sub(pcp, 1)
2019/11/16 17:45:00 akmodsbuild: |                              ^~~~~~~~~~~~~~
2019/11/16 17:45:00 akmodsbuild: ./include/linux/percpu-rwsem.h:91:3: note: in expansion of macro '__this_cpu_dec'
2019/11/16 17:45:00 akmodsbuild: 91 |   __this_cpu_dec(*sem->read_count);
2019/11/16 17:45:00 akmodsbuild: |   ^~~~~~~~~~~~~~
2019/11/16 17:45:00 akmodsbuild: ./arch/x86/include/asm/percpu.h:131:31: warning: comparison of integer expressions of different signedness: 'unsigned int' and 'int' [-Wsign-compare]
2019/11/16 17:45:00 akmodsbuild: 131 |          ((val) == 1 || (val) == -1)) ?        |                               ^~
2019/11/16 17:45:00 akmodsbuild: ./arch/x86/include/asm/percpu.h:403:34: note: in expansion of macro 'percpu_add_op'
2019/11/16 17:45:00 akmodsbuild: 403 | #define raw_cpu_add_4(pcp, val)  percpu_add_op(, (pcp), val)
2019/11/16 17:45:00 akmodsbuild: |                                  ^~~~~~~~~~~~~
2019/11/16 17:45:00 akmodsbuild: ./include/linux/percpu-defs.h:380:11: note: in expansion of macro 'raw_cpu_add_4'
2019/11/16 17:45:00 akmodsbuild: 380 |   case 4: stem##4(variable, __VA_ARGS__);break;        |           ^~~~
2019/11/16 17:45:00 akmodsbuild: ./include/linux/percpu-defs.h:423:32: note: in expansion of macro '__pcpu_size_call'
2019/11/16 17:45:00 akmodsbuild: 423 | #define raw_cpu_add(pcp, val)  __pcpu_size_call(raw_cpu_add_, pcp, val)
2019/11/16 17:45:00 akmodsbuild: |                                ^~~~~~~~~~~~~~~~
2019/11/16 17:45:00 akmodsbuild: ./include/linux/percpu-defs.h:459:2: note: in expansion of macro 'raw_cpu_add'
2019/11/16 17:45:00 akmodsbuild: 459 |  raw_cpu_add(pcp, val);            |  ^~~~~~~~~~~
2019/11/16 17:45:00 akmodsbuild: ./include/linux/percpu-defs.h:497:34: note: in expansion of macro '__this_cpu_add'
2019/11/16 17:45:00 akmodsbuild: 497 | #define __this_cpu_sub(pcp, val) __this_cpu_add(pcp, -(typeof(pcp))(val))
2019/11/16 17:45:00 akmodsbuild: |                                  ^~~~~~~~~~~~~~
2019/11/16 17:45:00 akmodsbuild: ./include/linux/percpu-defs.h:499:30: note: in expansion of macro '__this_cpu_sub'
2019/11/16 17:45:00 akmodsbuild: 499 | #define __this_cpu_dec(pcp)  __this_cpu_sub(pcp, 1)
2019/11/16 17:45:00 akmodsbuild: |                              ^~~~~~~~~~~~~~
2019/11/16 17:45:00 akmodsbuild: ./include/linux/percpu-rwsem.h:91:3: note: in expansion of macro '__this_cpu_dec'
2019/11/16 17:45:00 akmodsbuild: 91 |   __this_cpu_dec(*sem->read_count);
2019/11/16 17:45:00 akmodsbuild: |   ^~~~~~~~~~~~~~
2019/11/16 17:45:00 akmodsbuild: ./arch/x86/include/asm/percpu.h:131:31: warning: comparison of integer expressions of different signedness: 'unsigned int' and 'int' [-Wsign-compare]
2019/11/16 17:45:00 akmodsbuild: 131 |          ((val) == 1 || (val) == -1)) ?        |                               ^~
2019/11/16 17:45:00 akmodsbuild: ./arch/x86/include/asm/percpu.h:483:35: note: in expansion of macro 'percpu_add_op'
2019/11/16 17:45:00 akmodsbuild: 483 | #define raw_cpu_add_8(pcp, val)   percpu_add_op(, (pcp), val)
2019/11/16 17:45:00 akmodsbuild: |                                   ^~~~~~~~~~~~~
2019/11/16 17:45:00 akmodsbuild: ./include/linux/percpu-defs.h:381:11: note: in expansion of macro 'raw_cpu_add_8'
2019/11/16 17:45:00 akmodsbuild: 381 |   case 8: stem##8(variable, __VA_ARGS__);break;        |           ^~~~
2019/11/16 17:45:00 akmodsbuild: ./include/linux/percpu-defs.h:423:32: note: in expansion of macro '__pcpu_size_call'
2019/11/16 17:45:00 akmodsbuild: 423 | #define raw_cpu_add(pcp, val)  __pcpu_size_call(raw_cpu_add_, pcp, val)
2019/11/16 17:45:00 akmodsbuild: |                                ^~~~~~~~~~~~~~~~
2019/11/16 17:45:00 akmodsbuild: ./include/linux/percpu-defs.h:459:2: note: in expansion of macro 'raw_cpu_add'
2019/11/16 17:45:00 akmodsbuild: 459 |  raw_cpu_add(pcp, val);            |  ^~~~~~~~~~~
2019/11/16 17:45:00 akmodsbuild: ./include/linux/percpu-defs.h:497:34: note: in expansion of macro '__this_cpu_add'
2019/11/16 17:45:00 akmodsbuild: 497 | #define __this_cpu_sub(pcp, val) __this_cpu_add(pcp, -(typeof(pcp))(val))
2019/11/16 17:45:00 akmodsbuild: |                                  ^~~~~~~~~~~~~~
2019/11/16 17:45:00 akmodsbuild: ./include/linux/percpu-defs.h:499:30: note: in expansion of macro '__this_cpu_sub'
2019/11/16 17:45:00 akmodsbuild: 499 | #define __this_cpu_dec(pcp)  __this_cpu_sub(pcp, 1)
2019/11/16 17:45:00 akmodsbuild: |                              ^~~~~~~~~~~~~~
2019/11/16 17:45:00 akmodsbuild: ./include/linux/percpu-rwsem.h:91:3: note: in expansion of macro '__this_cpu_dec'
2019/11/16 17:45:00 akmodsbuild: 91 |   __this_cpu_dec(*sem->read_count);
2019/11/16 17:45:00 akmodsbuild: |   ^~~~~~~~~~~~~~
2019/11/16 17:45:00 akmodsbuild: ./include/linux/percpu-rwsem.h: In function 'percpu_up_read':
2019/11/16 17:45:00 akmodsbuild: ./arch/x86/include/asm/percpu.h:131:31: warning: comparison of integer expressions of different signedness: 'unsigned int' and 'int' [-Wsign-compare]
2019/11/16 17:45:00 akmodsbuild: 131 |          ((val) == 1 || (val) == -1)) ?        |                               ^~
2019/11/16 17:45:00 akmodsbuild: ./arch/x86/include/asm/percpu.h:401:34: note: in expansion of macro 'percpu_add_op'
2019/11/16 17:45:00 akmodsbuild: 401 | #define raw_cpu_add_1(pcp, val)  percpu_add_op(, (pcp), val)
2019/11/16 17:45:00 akmodsbuild: |                                  ^~~~~~~~~~~~~
2019/11/16 17:45:00 akmodsbuild: ./include/linux/percpu-defs.h:378:11: note: in expansion of macro 'raw_cpu_add_1'
2019/11/16 17:45:00 akmodsbuild: 378 |   case 1: stem##1(variable, __VA_ARGS__);break;        |           ^~~~
2019/11/16 17:45:00 akmodsbuild: ./include/linux/percpu-defs.h:423:32: note: in expansion of macro '__pcpu_size_call'
2019/11/16 17:45:00 akmodsbuild: 423 | #define raw_cpu_add(pcp, val)  __pcpu_size_call(raw_cpu_add_, pcp, val)
2019/11/16 17:45:00 akmodsbuild: |                                ^~~~~~~~~~~~~~~~
2019/11/16 17:45:00 akmodsbuild: ./include/linux/percpu-defs.h:459:2: note: in expansion of macro 'raw_cpu_add'
2019/11/16 17:45:00 akmodsbuild: 459 |  raw_cpu_add(pcp, val);            |  ^~~~~~~~~~~
2019/11/16 17:45:00 akmodsbuild: ./include/linux/percpu-defs.h:497:34: note: in expansion of macro '__this_cpu_add'
2019/11/16 17:45:00 akmodsbuild: 497 | #define __this_cpu_sub(pcp, val) __this_cpu_add(pcp, -(typeof(pcp))(val))
2019/11/16 17:45:00 akmodsbuild: |                                  ^~~~~~~~~~~~~~
2019/11/16 17:45:00 akmodsbuild: ./include/linux/percpu-defs.h:499:30: note: in expansion of macro '__this_cpu_sub'
2019/11/16 17:45:00 akmodsbuild: 499 | #define __this_cpu_dec(pcp)  __this_cpu_sub(pcp, 1)
2019/11/16 17:45:00 akmodsbuild: |                              ^~~~~~~~~~~~~~
2019/11/16 17:45:00 akmodsbuild: ./include/linux/percpu-rwsem.h:91:3: note: in expansion of macro '__this_cpu_dec'
2019/11/16 17:45:00 akmodsbuild: 91 |   __this_cpu_dec(*sem->read_count);
2019/11/16 17:45:00 akmodsbuild: |   ^~~~~~~~~~~~~~
2019/11/16 17:45:00 akmodsbuild: ./arch/x86/include/asm/percpu.h:131:31: warning: comparison of integer expressions of different signedness: 'unsigned int' and 'int' [-Wsign-compare]
2019/11/16 17:45:00 akmodsbuild: 131 |          ((val) == 1 || (val) == -1)) ?        |                               ^~
2019/11/16 17:45:00 akmodsbuild: ./arch/x86/include/asm/percpu.h:402:34: note: in expansion of macro 'percpu_add_op'
2019/11/16 17:45:00 akmodsbuild: 402 | #define raw_cpu_add_2(pcp, val)  percpu_add_op(, (pcp), val)
2019/11/16 17:45:00 akmodsbuild: |                                  ^~~~~~~~~~~~~
2019/11/16 17:45:00 akmodsbuild: ./include/linux/percpu-defs.h:379:11: note: in expansion of macro 'raw_cpu_add_2'
2019/11/16 17:45:00 akmodsbuild: 379 |   case 2: stem##2(variable, __VA_ARGS__);break;        |           ^~~~
2019/11/16 17:45:00 akmodsbuild: ./include/linux/percpu-defs.h:423:32: note: in expansion of macro '__pcpu_size_call'
2019/11/16 17:45:00 akmodsbuild: 423 | #define raw_cpu_add(pcp, val)  __pcpu_size_call(raw_cpu_add_, pcp, val)
2019/11/16 17:45:00 akmodsbuild: |                                ^~~~~~~~~~~~~~~~
2019/11/16 17:45:00 akmodsbuild: ./include/linux/percpu-defs.h:459:2: note: in expansion of macro 'raw_cpu_add'
2019/11/16 17:45:00 akmodsbuild: 459 |  raw_cpu_add(pcp, val);            |  ^~~~~~~~~~~
2019/11/16 17:45:00 akmodsbuild: ./include/linux/percpu-defs.h:497:34: note: in expansion of macro '__this_cpu_add'
2019/11/16 17:45:00 akmodsbuild: 497 | #define __this_cpu_sub(pcp, val) __this_cpu_add(pcp, -(typeof(pcp))(val))
2019/11/16 17:45:00 akmodsbuild: |                                  ^~~~~~~~~~~~~~
2019/11/16 17:45:00 akmodsbuild: ./include/linux/percpu-defs.h:499:30: note: in expansion of macro '__this_cpu_sub'
2019/11/16 17:45:00 akmodsbuild: 499 | #define __this_cpu_dec(pcp)  __this_cpu_sub(pcp, 1)
2019/11/16 17:45:00 akmodsbuild: |                              ^~~~~~~~~~~~~~
2019/11/16 17:45:00 akmodsbuild: ./include/linux/percpu-rwsem.h:91:3: note: in expansion of macro '__this_cpu_dec'
2019/11/16 17:45:00 akmodsbuild: 91 |   __this_cpu_dec(*sem->read_count);
2019/11/16 17:45:00 akmodsbuild: |   ^~~~~~~~~~~~~~
2019/11/16 17:45:00 akmodsbuild: ./arch/x86/include/asm/percpu.h:131:31: warning: comparison of integer expressions of different signedness: 'unsigned int' and 'int' [-Wsign-compare]
2019/11/16 17:45:00 akmodsbuild: 131 |          ((val) == 1 || (val) == -1)) ?        |                               ^~
2019/11/16 17:45:00 akmodsbuild: ./arch/x86/include/asm/percpu.h:403:34: note: in expansion of macro 'percpu_add_op'
2019/11/16 17:45:00 akmodsbuild: 403 | #define raw_cpu_add_4(pcp, val)  percpu_add_op(, (pcp), val)
2019/11/16 17:45:00 akmodsbuild: |                                  ^~~~~~~~~~~~~
2019/11/16 17:45:00 akmodsbuild: ./include/linux/percpu-defs.h:380:11: note: in expansion of macro 'raw_cpu_add_4'
2019/11/16 17:45:00 akmodsbuild: 380 |   case 4: stem##4(variable, __VA_ARGS__);break;        |           ^~~~
2019/11/16 17:45:00 akmodsbuild: ./include/linux/percpu-defs.h:423:32: note: in expansion of macro '__pcpu_size_call'
2019/11/16 17:45:00 akmodsbuild: 423 | #define raw_cpu_add(pcp, val)  __pcpu_size_call(raw_cpu_add_, pcp, val)
2019/11/16 17:45:00 akmodsbuild: |                                ^~~~~~~~~~~~~~~~
2019/11/16 17:45:00 akmodsbuild: ./include/linux/percpu-defs.h:459:2: note: in expansion of macro 'raw_cpu_add'
2019/11/16 17:45:00 akmodsbuild: 459 |  raw_cpu_add(pcp, val);            |  ^~~~~~~~~~~
2019/11/16 17:45:00 akmodsbuild: ./include/linux/percpu-defs.h:497:34: note: in expansion of macro '__this_cpu_add'
2019/11/16 17:45:00 akmodsbuild: 497 | #define __this_cpu_sub(pcp, val) __this_cpu_add(pcp, -(typeof(pcp))(val))
2019/11/16 17:45:00 akmodsbuild: |                                  ^~~~~~~~~~~~~~
2019/11/16 17:45:00 akmodsbuild: ./include/linux/percpu-defs.h:499:30: note: in expansion of macro '__this_cpu_sub'
2019/11/16 17:45:00 akmodsbuild: 499 | #define __this_cpu_dec(pcp)  __this_cpu_sub(pcp, 1)
2019/11/16 17:45:00 akmodsbuild: |                              ^~~~~~~~~~~~~~
2019/11/16 17:45:00 akmodsbuild: ./include/linux/percpu-rwsem.h:91:3: note: in expansion of macro '__this_cpu_dec'
2019/11/16 17:45:00 akmodsbuild: 91 |   __this_cpu_dec(*sem->read_count);
2019/11/16 17:45:00 akmodsbuild: |   ^~~~~~~~~~~~~~
2019/11/16 17:45:00 akmodsbuild: ./arch/x86/include/asm/percpu.h:131:31: warning: comparison of integer expressions of different signedness: 'unsigned int' and 'int' [-Wsign-compare]
2019/11/16 17:45:00 akmodsbuild: 131 |          ((val) == 1 || (val) == -1)) ?        |                               ^~
2019/11/16 17:45:00 akmodsbuild: ./arch/x86/include/asm/percpu.h:483:35: note: in expansion of macro 'percpu_add_op'
2019/11/16 17:45:00 akmodsbuild: 483 | #define raw_cpu_add_8(pcp, val)   percpu_add_op(, (pcp), val)
2019/11/16 17:45:00 akmodsbuild: |                                   ^~~~~~~~~~~~~
2019/11/16 17:45:00 akmodsbuild: ./include/linux/percpu-defs.h:381:11: note: in expansion of macro 'raw_cpu_add_8'
2019/11/16 17:45:00 akmodsbuild: 381 |   case 8: stem##8(variable, __VA_ARGS__);break;        |           ^~~~
2019/11/16 17:45:00 akmodsbuild: ./include/linux/percpu-defs.h:423:32: note: in expansion of macro '__pcpu_size_call'
2019/11/16 17:45:00 akmodsbuild: 423 | #define raw_cpu_add(pcp, val)  __pcpu_size_call(raw_cpu_add_, pcp, val)
2019/11/16 17:45:00 akmodsbuild: |                                ^~~~~~~~~~~~~~~~
2019/11/16 17:45:00 akmodsbuild: ./include/linux/percpu-defs.h:459:2: note: in expansion of macro 'raw_cpu_add'
2019/11/16 17:45:00 akmodsbuild: 459 |  raw_cpu_add(pcp, val);            |  ^~~~~~~~~~~
2019/11/16 17:45:00 akmodsbuild: ./include/linux/percpu-defs.h:497:34: note: in expansion of macro '__this_cpu_add'
2019/11/16 17:45:00 akmodsbuild: 497 | #define __this_cpu_sub(pcp, val) __this_cpu_add(pcp, -(typeof(pcp))(val))
2019/11/16 17:45:00 akmodsbuild: |                                  ^~~~~~~~~~~~~~
2019/11/16 17:45:00 akmodsbuild: ./include/linux/percpu-defs.h:499:30: note: in expansion of macro '__this_cpu_sub'
2019/11/16 17:45:00 akmodsbuild: 499 | #define __this_cpu_dec(pcp)  __this_cpu_sub(pcp, 1)
2019/11/16 17:45:00 akmodsbuild: |                              ^~~~~~~~~~~~~~
2019/11/16 17:45:00 akmodsbuild: ./include/linux/percpu-rwsem.h:91:3: note: in expansion of macro '__this_cpu_dec'
2019/11/16 17:45:00 akmodsbuild: 91 |   __this_cpu_dec(*sem->read_count);
2019/11/16 17:45:00 akmodsbuild: |   ^~~~~~~~~~~~~~
2019/11/16 17:45:00 akmodsbuild: ./include/linux/percpu-rwsem.h: In function 'percpu_up_read':
2019/11/16 17:45:00 akmodsbuild: ./arch/x86/include/asm/percpu.h:131:31: warning: comparison of integer expressions of different signedness: 'unsigned int' and 'int' [-Wsign-compare]
2019/11/16 17:45:00 akmodsbuild: 131 |          ((val) == 1 || (val) == -1)) ?        |                               ^~
2019/11/16 17:45:00 akmodsbuild: ./arch/x86/include/asm/percpu.h:401:34: note: in expansion of macro 'percpu_add_op'
2019/11/16 17:45:00 akmodsbuild: 401 | #define raw_cpu_add_1(pcp, val)  percpu_add_op(, (pcp), val)
2019/11/16 17:45:00 akmodsbuild: |                                  ^~~~~~~~~~~~~
2019/11/16 17:45:00 akmodsbuild: ./include/linux/percpu-defs.h:378:11: note: in expansion of macro 'raw_cpu_add_1'
2019/11/16 17:45:00 akmodsbuild: 378 |   case 1: stem##1(variable, __VA_ARGS__);break;        |           ^~~~
2019/11/16 17:45:00 akmodsbuild: ./include/linux/percpu-defs.h:423:32: note: in expansion of macro '__pcpu_size_call'
2019/11/16 17:45:00 akmodsbuild: 423 | #define raw_cpu_add(pcp, val)  __pcpu_size_call(raw_cpu_add_, pcp, val)
2019/11/16 17:45:00 akmodsbuild: |                                ^~~~~~~~~~~~~~~~
2019/11/16 17:45:00 akmodsbuild: ./include/linux/percpu-defs.h:459:2: note: in expansion of macro 'raw_cpu_add'
2019/11/16 17:45:00 akmodsbuild: 459 |  raw_cpu_add(pcp, val);            |  ^~~~~~~~~~~
2019/11/16 17:45:00 akmodsbuild: ./include/linux/percpu-defs.h:497:34: note: in expansion of macro '__this_cpu_add'
2019/11/16 17:45:00 akmodsbuild: 497 | #define __this_cpu_sub(pcp, val) __this_cpu_add(pcp, -(typeof(pcp))(val))
2019/11/16 17:45:00 akmodsbuild: |                                  ^~~~~~~~~~~~~~
2019/11/16 17:45:00 akmodsbuild: ./include/linux/percpu-defs.h:499:30: note: in expansion of macro '__this_cpu_sub'
2019/11/16 17:45:00 akmodsbuild: 499 | #define __this_cpu_dec(pcp)  __this_cpu_sub(pcp, 1)
2019/11/16 17:45:00 akmodsbuild: |                              ^~~~~~~~~~~~~~
2019/11/16 17:45:00 akmodsbuild: ./include/linux/percpu-rwsem.h:91:3: note: in expansion of macro '__this_cpu_dec'
2019/11/16 17:45:00 akmodsbuild: 91 |   __this_cpu_dec(*sem->read_count);
2019/11/16 17:45:00 akmodsbuild: |   ^~~~~~~~~~~~~~
2019/11/16 17:45:00 akmodsbuild: ./arch/x86/include/asm/percpu.h:131:31: warning: comparison of integer expressions of different signedness: 'unsigned int' and 'int' [-Wsign-compare]
2019/11/16 17:45:00 akmodsbuild: 131 |          ((val) == 1 || (val) == -1)) ?        |                               ^~
2019/11/16 17:45:00 akmodsbuild: ./arch/x86/include/asm/percpu.h:402:34: note: in expansion of macro 'percpu_add_op'
2019/11/16 17:45:00 akmodsbuild: 402 | #define raw_cpu_add_2(pcp, val)  percpu_add_op(, (pcp), val)
2019/11/16 17:45:00 akmodsbuild: |                                  ^~~~~~~~~~~~~
2019/11/16 17:45:00 akmodsbuild: ./include/linux/percpu-defs.h:379:11: note: in expansion of macro 'raw_cpu_add_2'
2019/11/16 17:45:00 akmodsbuild: 379 |   case 2: stem##2(variable, __VA_ARGS__);break;        |           ^~~~
2019/11/16 17:45:00 akmodsbuild: ./include/linux/percpu-defs.h:423:32: note: in expansion of macro '__pcpu_size_call'
2019/11/16 17:45:00 akmodsbuild: 423 | #define raw_cpu_add(pcp, val)  __pcpu_size_call(raw_cpu_add_, pcp, val)
2019/11/16 17:45:00 akmodsbuild: |                                ^~~~~~~~~~~~~~~~
2019/11/16 17:45:00 akmodsbuild: ./include/linux/percpu-defs.h:459:2: note: in expansion of macro 'raw_cpu_add'
2019/11/16 17:45:00 akmodsbuild: 459 |  raw_cpu_add(pcp, val);            |  ^~~~~~~~~~~
2019/11/16 17:45:00 akmodsbuild: ./include/linux/percpu-defs.h:497:34: note: in expansion of macro '__this_cpu_add'
2019/11/16 17:45:00 akmodsbuild: 497 | #define __this_cpu_sub(pcp, val) __this_cpu_add(pcp, -(typeof(pcp))(val))
2019/11/16 17:45:00 akmodsbuild: |                                  ^~~~~~~~~~~~~~
2019/11/16 17:45:00 akmodsbuild: ./include/linux/percpu-defs.h:499:30: note: in expansion of macro '__this_cpu_sub'
2019/11/16 17:45:00 akmodsbuild: 499 | #define __this_cpu_dec(pcp)  __this_cpu_sub(pcp, 1)
2019/11/16 17:45:00 akmodsbuild: |                              ^~~~~~~~~~~~~~
2019/11/16 17:45:00 akmodsbuild: ./include/linux/percpu-rwsem.h:91:3: note: in expansion of macro '__this_cpu_dec'
2019/11/16 17:45:00 akmodsbuild: 91 |   __this_cpu_dec(*sem->read_count);
2019/11/16 17:45:00 akmodsbuild: |   ^~~~~~~~~~~~~~
2019/11/16 17:45:00 akmodsbuild: ./arch/x86/include/asm/percpu.h:131:31: warning: comparison of integer expressions of different signedness: 'unsigned int' and 'int' [-Wsign-compare]
2019/11/16 17:45:00 akmodsbuild: 131 |          ((val) == 1 || (val) == -1)) ?        |                               ^~
2019/11/16 17:45:00 akmodsbuild: ./arch/x86/include/asm/percpu.h:403:34: note: in expansion of macro 'percpu_add_op'
2019/11/16 17:45:00 akmodsbuild: 403 | #define raw_cpu_add_4(pcp, val)  percpu_add_op(, (pcp), val)
2019/11/16 17:45:00 akmodsbuild: |                                  ^~~~~~~~~~~~~
2019/11/16 17:45:00 akmodsbuild: ./include/linux/percpu-defs.h:380:11: note: in expansion of macro 'raw_cpu_add_4'
2019/11/16 17:45:00 akmodsbuild: 380 |   case 4: stem##4(variable, __VA_ARGS__);break;        |           ^~~~
2019/11/16 17:45:00 akmodsbuild: ./include/linux/percpu-defs.h:423:32: note: in expansion of macro '__pcpu_size_call'
2019/11/16 17:45:00 akmodsbuild: 423 | #define raw_cpu_add(pcp, val)  __pcpu_size_call(raw_cpu_add_, pcp, val)
2019/11/16 17:45:00 akmodsbuild: |                                ^~~~~~~~~~~~~~~~
2019/11/16 17:45:00 akmodsbuild: ./include/linux/percpu-defs.h:459:2: note: in expansion of macro 'raw_cpu_add'
2019/11/16 17:45:00 akmodsbuild: 459 |  raw_cpu_add(pcp, val);            |  ^~~~~~~~~~~
2019/11/16 17:45:00 akmodsbuild: ./include/linux/percpu-defs.h:497:34: note: in expansion of macro '__this_cpu_add'
2019/11/16 17:45:00 akmodsbuild: 497 | #define __this_cpu_sub(pcp, val) __this_cpu_add(pcp, -(typeof(pcp))(val))
2019/11/16 17:45:00 akmodsbuild: |                                  ^~~~~~~~~~~~~~
2019/11/16 17:45:00 akmodsbuild: ./include/linux/percpu-defs.h:499:30: note: in expansion of macro '__this_cpu_sub'
2019/11/16 17:45:00 akmodsbuild: 499 | #define __this_cpu_dec(pcp)  __this_cpu_sub(pcp, 1)
2019/11/16 17:45:00 akmodsbuild: |                              ^~~~~~~~~~~~~~
2019/11/16 17:45:01 akmodsbuild: ./include/linux/percpu-rwsem.h:91:3: note: in expansion of macro '__this_cpu_dec'
2019/11/16 17:45:01 akmodsbuild: 91 |   __this_cpu_dec(*sem->read_count);
2019/11/16 17:45:01 akmodsbuild: |   ^~~~~~~~~~~~~~
2019/11/16 17:45:01 akmodsbuild: ./arch/x86/include/asm/percpu.h:131:31: warning: comparison of integer expressions of different signedness: 'unsigned int' and 'int' [-Wsign-compare]
2019/11/16 17:45:01 akmodsbuild: 131 |          ((val) == 1 || (val) == -1)) ?        |                               ^~
2019/11/16 17:45:01 akmodsbuild: ./arch/x86/include/asm/percpu.h:483:35: note: in expansion of macro 'percpu_add_op'
2019/11/16 17:45:01 akmodsbuild: 483 | #define raw_cpu_add_8(pcp, val)   percpu_add_op(, (pcp), val)
2019/11/16 17:45:01 akmodsbuild: |                                   ^~~~~~~~~~~~~
2019/11/16 17:45:01 akmodsbuild: ./include/linux/percpu-defs.h:381:11: note: in expansion of macro 'raw_cpu_add_8'
2019/11/16 17:45:01 akmodsbuild: 381 |   case 8: stem##8(variable, __VA_ARGS__);break;        |           ^~~~
2019/11/16 17:45:01 akmodsbuild: ./include/linux/percpu-defs.h:423:32: note: in expansion of macro '__pcpu_size_call'
2019/11/16 17:45:01 akmodsbuild: 423 | #define raw_cpu_add(pcp, val)  __pcpu_size_call(raw_cpu_add_, pcp, val)
2019/11/16 17:45:01 akmodsbuild: |                                ^~~~~~~~~~~~~~~~
2019/11/16 17:45:01 akmodsbuild: ./include/linux/percpu-defs.h:459:2: note: in expansion of macro 'raw_cpu_add'
2019/11/16 17:45:01 akmodsbuild: 459 |  raw_cpu_add(pcp, val);            |  ^~~~~~~~~~~
2019/11/16 17:45:01 akmodsbuild: ./include/linux/percpu-defs.h:497:34: note: in expansion of macro '__this_cpu_add'
2019/11/16 17:45:01 akmodsbuild: 497 | #define __this_cpu_sub(pcp, val) __this_cpu_add(pcp, -(typeof(pcp))(val))
2019/11/16 17:45:01 akmodsbuild: |                                  ^~~~~~~~~~~~~~
2019/11/16 17:45:01 akmodsbuild: ./include/linux/percpu-defs.h:499:30: note: in expansion of macro '__this_cpu_sub'
2019/11/16 17:45:01 akmodsbuild: 499 | #define __this_cpu_dec(pcp)  __this_cpu_sub(pcp, 1)
2019/11/16 17:45:01 akmodsbuild: |                              ^~~~~~~~~~~~~~
2019/11/16 17:45:01 akmodsbuild: ./include/linux/percpu-rwsem.h:91:3: note: in expansion of macro '__this_cpu_dec'
2019/11/16 17:45:01 akmodsbuild: 91 |   __this_cpu_dec(*sem->read_count);
2019/11/16 17:45:01 akmodsbuild: |   ^~~~~~~~~~~~~~
2019/11/16 17:45:01 akmodsbuild: ./include/linux/percpu-rwsem.h: In function 'percpu_up_read':
2019/11/16 17:45:01 akmodsbuild: ./arch/x86/include/asm/percpu.h:131:31: warning: comparison of integer expressions of different signedness: 'unsigned int' and 'int' [-Wsign-compare]
2019/11/16 17:45:01 akmodsbuild: 131 |          ((val) == 1 || (val) == -1)) ?        |                               ^~
2019/11/16 17:45:01 akmodsbuild: ./arch/x86/include/asm/percpu.h:401:34: note: in expansion of macro 'percpu_add_op'
2019/11/16 17:45:01 akmodsbuild: 401 | #define raw_cpu_add_1(pcp, val)  percpu_add_op(, (pcp), val)
2019/11/16 17:45:01 akmodsbuild: |                                  ^~~~~~~~~~~~~
2019/11/16 17:45:01 akmodsbuild: ./include/linux/percpu-defs.h:378:11: note: in expansion of macro 'raw_cpu_add_1'
2019/11/16 17:45:01 akmodsbuild: 378 |   case 1: stem##1(variable, __VA_ARGS__);break;        |           ^~~~
2019/11/16 17:45:01 akmodsbuild: ./include/linux/percpu-defs.h:423:32: note: in expansion of macro '__pcpu_size_call'
2019/11/16 17:45:01 akmodsbuild: 423 | #define raw_cpu_add(pcp, val)  __pcpu_size_call(raw_cpu_add_, pcp, val)
2019/11/16 17:45:01 akmodsbuild: |                                ^~~~~~~~~~~~~~~~
2019/11/16 17:45:01 akmodsbuild: ./include/linux/percpu-defs.h:459:2: note: in expansion of macro 'raw_cpu_add'
2019/11/16 17:45:01 akmodsbuild: 459 |  raw_cpu_add(pcp, val);            |  ^~~~~~~~~~~
2019/11/16 17:45:01 akmodsbuild: ./include/linux/percpu-defs.h:497:34: note: in expansion of macro '__this_cpu_add'
2019/11/16 17:45:01 akmodsbuild: 497 | #define __this_cpu_sub(pcp, val) __this_cpu_add(pcp, -(typeof(pcp))(val))
2019/11/16 17:45:01 akmodsbuild: |                                  ^~~~~~~~~~~~~~
2019/11/16 17:45:01 akmodsbuild: ./include/linux/percpu-defs.h:499:30: note: in expansion of macro '__this_cpu_sub'
2019/11/16 17:45:01 akmodsbuild: 499 | #define __this_cpu_dec(pcp)  __this_cpu_sub(pcp, 1)
2019/11/16 17:45:01 akmodsbuild: |                              ^~~~~~~~~~~~~~
2019/11/16 17:45:01 akmodsbuild: ./include/linux/percpu-rwsem.h:91:3: note: in expansion of macro '__this_cpu_dec'
2019/11/16 17:45:01 akmodsbuild: 91 |   __this_cpu_dec(*sem->read_count);
2019/11/16 17:45:01 akmodsbuild: |   ^~~~~~~~~~~~~~
2019/11/16 17:45:01 akmodsbuild: ./arch/x86/include/asm/percpu.h:131:31: warning: comparison of integer expressions of different signedness: 'unsigned int' and 'int' [-Wsign-compare]
2019/11/16 17:45:01 akmodsbuild: 131 |          ((val) == 1 || (val) == -1)) ?        |                               ^~
2019/11/16 17:45:01 akmodsbuild: ./arch/x86/include/asm/percpu.h:402:34: note: in expansion of macro 'percpu_add_op'
2019/11/16 17:45:01 akmodsbuild: 402 | #define raw_cpu_add_2(pcp, val)  percpu_add_op(, (pcp), val)
2019/11/16 17:45:01 akmodsbuild: |                                  ^~~~~~~~~~~~~
2019/11/16 17:45:01 akmodsbuild: ./include/linux/percpu-defs.h:379:11: note: in expansion of macro 'raw_cpu_add_2'
2019/11/16 17:45:01 akmodsbuild: 379 |   case 2: stem##2(variable, __VA_ARGS__);break;        |           ^~~~
2019/11/16 17:45:01 akmodsbuild: ./include/linux/percpu-defs.h:423:32: note: in expansion of macro '__pcpu_size_call'
2019/11/16 17:45:01 akmodsbuild: 423 | #define raw_cpu_add(pcp, val)  __pcpu_size_call(raw_cpu_add_, pcp, val)
2019/11/16 17:45:01 akmodsbuild: |                                ^~~~~~~~~~~~~~~~
2019/11/16 17:45:01 akmodsbuild: ./include/linux/percpu-defs.h:459:2: note: in expansion of macro 'raw_cpu_add'
2019/11/16 17:45:01 akmodsbuild: 459 |  raw_cpu_add(pcp, val);            |  ^~~~~~~~~~~
2019/11/16 17:45:01 akmodsbuild: ./include/linux/percpu-defs.h:497:34: note: in expansion of macro '__this_cpu_add'
2019/11/16 17:45:01 akmodsbuild: 497 | #define __this_cpu_sub(pcp, val) __this_cpu_add(pcp, -(typeof(pcp))(val))
2019/11/16 17:45:01 akmodsbuild: |                                  ^~~~~~~~~~~~~~
2019/11/16 17:45:01 akmodsbuild: ./include/linux/percpu-defs.h:499:30: note: in expansion of macro '__this_cpu_sub'
2019/11/16 17:45:01 akmodsbuild: 499 | #define __this_cpu_dec(pcp)  __this_cpu_sub(pcp, 1)
2019/11/16 17:45:01 akmodsbuild: |                              ^~~~~~~~~~~~~~
2019/11/16 17:45:01 akmodsbuild: ./include/linux/percpu-rwsem.h:91:3: note: in expansion of macro '__this_cpu_dec'
2019/11/16 17:45:01 akmodsbuild: 91 |   __this_cpu_dec(*sem->read_count);
2019/11/16 17:45:01 akmodsbuild: |   ^~~~~~~~~~~~~~
2019/11/16 17:45:01 akmodsbuild: ./arch/x86/include/asm/percpu.h:131:31: warning: comparison of integer expressions of different signedness: 'unsigned int' and 'int' [-Wsign-compare]
2019/11/16 17:45:01 akmodsbuild: 131 |          ((val) == 1 || (val) == -1)) ?        |                               ^~
2019/11/16 17:45:01 akmodsbuild: ./arch/x86/include/asm/percpu.h:403:34: note: in expansion of macro 'percpu_add_op'
2019/11/16 17:45:01 akmodsbuild: 403 | #define raw_cpu_add_4(pcp, val)  percpu_add_op(, (pcp), val)
2019/11/16 17:45:01 akmodsbuild: |                                  ^~~~~~~~~~~~~
2019/11/16 17:45:01 akmodsbuild: ./include/linux/percpu-defs.h:380:11: note: in expansion of macro 'raw_cpu_add_4'
2019/11/16 17:45:01 akmodsbuild: 380 |   case 4: stem##4(variable, __VA_ARGS__);break;        |           ^~~~
2019/11/16 17:45:01 akmodsbuild: ./include/linux/percpu-defs.h:423:32: note: in expansion of macro '__pcpu_size_call'
2019/11/16 17:45:01 akmodsbuild: 423 | #define raw_cpu_add(pcp, val)  __pcpu_size_call(raw_cpu_add_, pcp, val)
2019/11/16 17:45:01 akmodsbuild: |                                ^~~~~~~~~~~~~~~~
2019/11/16 17:45:01 akmodsbuild: ./include/linux/percpu-defs.h:459:2: note: in expansion of macro 'raw_cpu_add'
2019/11/16 17:45:01 akmodsbuild: 459 |  raw_cpu_add(pcp, val);            |  ^~~~~~~~~~~
2019/11/16 17:45:01 akmodsbuild: ./include/linux/percpu-defs.h:497:34: note: in expansion of macro '__this_cpu_add'
2019/11/16 17:45:01 akmodsbuild: 497 | #define __this_cpu_sub(pcp, val) __this_cpu_add(pcp, -(typeof(pcp))(val))
2019/11/16 17:45:01 akmodsbuild: |                                  ^~~~~~~~~~~~~~
2019/11/16 17:45:01 akmodsbuild: ./include/linux/percpu-defs.h:499:30: note: in expansion of macro '__this_cpu_sub'
2019/11/16 17:45:01 akmodsbuild: 499 | #define __this_cpu_dec(pcp)  __this_cpu_sub(pcp, 1)
2019/11/16 17:45:01 akmodsbuild: |                              ^~~~~~~~~~~~~~
2019/11/16 17:45:01 akmodsbuild: ./include/linux/percpu-rwsem.h:91:3: note: in expansion of macro '__this_cpu_dec'
2019/11/16 17:45:01 akmodsbuild: 91 |   __this_cpu_dec(*sem->read_count);
2019/11/16 17:45:01 akmodsbuild: |   ^~~~~~~~~~~~~~
2019/11/16 17:45:01 akmodsbuild: ./arch/x86/include/asm/percpu.h:131:31: warning: comparison of integer expressions of different signedness: 'unsigned int' and 'int' [-Wsign-compare]
2019/11/16 17:45:01 akmodsbuild: 131 |          ((val) == 1 || (val) == -1)) ?        |                               ^~
2019/11/16 17:45:01 akmodsbuild: ./arch/x86/include/asm/percpu.h:483:35: note: in expansion of macro 'percpu_add_op'
2019/11/16 17:45:01 akmodsbuild: 483 | #define raw_cpu_add_8(pcp, val)   percpu_add_op(, (pcp), val)
2019/11/16 17:45:01 akmodsbuild: |                                   ^~~~~~~~~~~~~
2019/11/16 17:45:01 akmodsbuild: ./include/linux/percpu-defs.h:381:11: note: in expansion of macro 'raw_cpu_add_8'
2019/11/16 17:45:01 akmodsbuild: 381 |   case 8: stem##8(variable, __VA_ARGS__);break;        |           ^~~~
2019/11/16 17:45:01 akmodsbuild: ./include/linux/percpu-defs.h:423:32: note: in expansion of macro '__pcpu_size_call'
2019/11/16 17:45:01 akmodsbuild: 423 | #define raw_cpu_add(pcp, val)  __pcpu_size_call(raw_cpu_add_, pcp, val)
2019/11/16 17:45:01 akmodsbuild: |                                ^~~~~~~~~~~~~~~~
2019/11/16 17:45:01 akmodsbuild: ./include/linux/percpu-defs.h:459:2: note: in expansion of macro 'raw_cpu_add'
2019/11/16 17:45:01 akmodsbuild: 459 |  raw_cpu_add(pcp, val);            |  ^~~~~~~~~~~
2019/11/16 17:45:01 akmodsbuild: ./include/linux/percpu-defs.h:497:34: note: in expansion of macro '__this_cpu_add'
2019/11/16 17:45:01 akmodsbuild: 497 | #define __this_cpu_sub(pcp, val) __this_cpu_add(pcp, -(typeof(pcp))(val))
2019/11/16 17:45:01 akmodsbuild: |                                  ^~~~~~~~~~~~~~
2019/11/16 17:45:01 akmodsbuild: ./include/linux/percpu-defs.h:499:30: note: in expansion of macro '__this_cpu_sub'
2019/11/16 17:45:01 akmodsbuild: 499 | #define __this_cpu_dec(pcp)  __this_cpu_sub(pcp, 1)
2019/11/16 17:45:01 akmodsbuild: |                              ^~~~~~~~~~~~~~
2019/11/16 17:45:01 akmodsbuild: ./include/linux/percpu-rwsem.h:91:3: note: in expansion of macro '__this_cpu_dec'
2019/11/16 17:45:01 akmodsbuild: 91 |   __this_cpu_dec(*sem->read_count);
2019/11/16 17:45:01 akmodsbuild: |   ^~~~~~~~~~~~~~
2019/11/16 17:45:01 akmodsbuild: In file included from ./arch/x86/include/asm/paravirt.h:17,
2019/11/16 17:45:01 akmodsbuild: from ./arch/x86/include/asm/irqflags.h:72,
2019/11/16 17:45:01 akmodsbuild: from ./include/linux/irqflags.h:16,
2019/11/16 17:45:01 akmodsbuild: from ./include/linux/rcupdate.h:26,
2019/11/16 17:45:01 akmodsbuild: from ./include/linux/rculist.h:11,
2019/11/16 17:45:01 akmodsbuild: from ./include/linux/pid.h:5,
2019/11/16 17:45:01 akmodsbuild: from ./include/linux/sched.h:14,
2019/11/16 17:45:01 akmodsbuild: from ./include/linux/utsname.h:6,
2019/11/16 17:45:01 akmodsbuild: from /tmp/akmodsbuild.BDZemvCW/BUILD/nvidia-340xx-kmod-340.107/_kmod_build_5.3.11-200.fc30.x86_64/nv-linux.h:44,
2019/11/16 17:45:01 akmodsbuild: from /tmp/akmodsbuild.BDZemvCW/BUILD/nvidia-340xx-kmod-340.107/_kmod_build_5.3.11-200.fc30.x86_64/nv-chrdev.c:15:
2019/11/16 17:45:01 akmodsbuild: ./include/linux/vmstat.h: In function 'zone_numa_state_snapshot':
2019/11/16 17:45:01 akmodsbuild: ./include/linux/cpumask.h:243:9: warning: comparison of integer expressions of different signedness: 'int' and 'unsigned int' [-Wsign-compare]
2019/11/16 17:45:01 akmodsbuild: 243 |   (cpu) < nr_cpu_ids;)
2019/11/16 17:45:01 akmodsbuild: |         ^
2019/11/16 17:45:01 akmodsbuild: ./include/linux/cpumask.h:777:36: note: in expansion of macro 'for_each_cpu'
2019/11/16 17:45:01 akmodsbuild: 777 | #define for_each_online_cpu(cpu)   for_each_cpu((cpu), cpu_online_mask)
2019/11/16 17:45:01 akmodsbuild: |                                    ^~~~~~~~~~~~
2019/11/16 17:45:01 akmodsbuild: ./include/linux/vmstat.h:156:2: note: in expansion of macro 'for_each_online_cpu'
2019/11/16 17:45:01 akmodsbuild: 156 |  for_each_online_cpu(cpu)
2019/11/16 17:45:01 akmodsbuild: |  ^~~~~~~~~~~~~~~~~~~
2019/11/16 17:45:01 akmodsbuild: ./include/linux/vmstat.h: In function 'zone_page_state_snapshot':
2019/11/16 17:45:01 akmodsbuild: ./include/linux/cpumask.h:243:9: warning: comparison of integer expressions of different signedness: 'int' and 'unsigned int' [-Wsign-compare]
2019/11/16 17:45:01 akmodsbuild: 243 |   (cpu) < nr_cpu_ids;)
2019/11/16 17:45:01 akmodsbuild: |         ^
2019/11/16 17:45:01 akmodsbuild: ./include/linux/cpumask.h:777:36: note: in expansion of macro 'for_each_cpu'
2019/11/16 17:45:01 akmodsbuild: 777 | #define for_each_online_cpu(cpu)   for_each_cpu((cpu), cpu_online_mask)
2019/11/16 17:45:01 akmodsbuild: |                                    ^~~~~~~~~~~~
2019/11/16 17:45:01 akmodsbuild: ./include/linux/vmstat.h:221:2: note: in expansion of macro 'for_each_online_cpu'
2019/11/16 17:45:01 akmodsbuild: 221 |  for_each_online_cpu(cpu)
2019/11/16 17:45:01 akmodsbuild: |  ^~~~~~~~~~~~~~~~~~~
2019/11/16 17:45:01 akmodsbuild: In file included from ./arch/x86/include/asm/paravirt.h:17,
2019/11/16 17:45:01 akmodsbuild: from ./arch/x86/include/asm/irqflags.h:72,
2019/11/16 17:45:01 akmodsbuild: from ./include/linux/irqflags.h:16,
2019/11/16 17:45:01 akmodsbuild: from ./include/linux/rcupdate.h:26,
2019/11/16 17:45:01 akmodsbuild: from ./include/linux/rculist.h:11,
2019/11/16 17:45:01 akmodsbuild: from ./include/linux/pid.h:5,
2019/11/16 17:45:01 akmodsbuild: from ./include/linux/sched.h:14,
2019/11/16 17:45:01 akmodsbuild: from ./include/linux/utsname.h:6,
2019/11/16 17:45:01 akmodsbuild: from /tmp/akmodsbuild.BDZemvCW/BUILD/nvidia-340xx-kmod-340.107/_kmod_build_5.3.11-200.fc30.x86_64/nv-linux.h:44,
2019/11/16 17:45:01 akmodsbuild: from /tmp/akmodsbuild.BDZemvCW/BUILD/nvidia-340xx-kmod-340.107/_kmod_build_5.3.11-200.fc30.x86_64/nv-cray.c:15:
2019/11/16 17:45:01 akmodsbuild: ./include/linux/vmstat.h: In function 'zone_numa_state_snapshot':
2019/11/16 17:45:01 akmodsbuild: ./include/linux/cpumask.h:243:9: warning: comparison of integer expressions of different signedness: 'int' and 'unsigned int' [-Wsign-compare]
2019/11/16 17:45:01 akmodsbuild: 243 |   (cpu) < nr_cpu_ids;)
2019/11/16 17:45:01 akmodsbuild: |         ^
2019/11/16 17:45:01 akmodsbuild: ./include/linux/cpumask.h:777:36: note: in expansion of macro 'for_each_cpu'
2019/11/16 17:45:01 akmodsbuild: 777 | #define for_each_online_cpu(cpu)   for_each_cpu((cpu), cpu_online_mask)
2019/11/16 17:45:01 akmodsbuild: |                                    ^~~~~~~~~~~~
2019/11/16 17:45:01 akmodsbuild: ./include/linux/vmstat.h:156:2: note: in expansion of macro 'for_each_online_cpu'
2019/11/16 17:45:01 akmodsbuild: 156 |  for_each_online_cpu(cpu)
2019/11/16 17:45:01 akmodsbuild: |  ^~~~~~~~~~~~~~~~~~~
2019/11/16 17:45:01 akmodsbuild: ./include/linux/vmstat.h: In function 'zone_page_state_snapshot':
2019/11/16 17:45:01 akmodsbuild: ./include/linux/cpumask.h:243:9: warning: comparison of integer expressions of different signedness: 'int' and 'unsigned int' [-Wsign-compare]
2019/11/16 17:45:01 akmodsbuild: 243 |   (cpu) < nr_cpu_ids;)
2019/11/16 17:45:01 akmodsbuild: |         ^
2019/11/16 17:45:01 akmodsbuild: ./include/linux/cpumask.h:777:36: note: in expansion of macro 'for_each_cpu'
2019/11/16 17:45:01 akmodsbuild: 777 | #define for_each_online_cpu(cpu)   for_each_cpu((cpu), cpu_online_mask)
2019/11/16 17:45:01 akmodsbuild: |                                    ^~~~~~~~~~~~
2019/11/16 17:45:01 akmodsbuild: ./include/linux/vmstat.h:221:2: note: in expansion of macro 'for_each_online_cpu'
2019/11/16 17:45:01 akmodsbuild: 221 |  for_each_online_cpu(cpu)
2019/11/16 17:45:01 akmodsbuild: |  ^~~~~~~~~~~~~~~~~~~
2019/11/16 17:45:01 akmodsbuild: In file included from ./arch/x86/include/asm/paravirt.h:17,
2019/11/16 17:45:01 akmodsbuild: from ./arch/x86/include/asm/irqflags.h:72,
2019/11/16 17:45:01 akmodsbuild: from ./include/linux/irqflags.h:16,
2019/11/16 17:45:01 akmodsbuild: from ./include/linux/rcupdate.h:26,
2019/11/16 17:45:01 akmodsbuild: from ./include/linux/rculist.h:11,
2019/11/16 17:45:01 akmodsbuild: from ./include/linux/pid.h:5,
2019/11/16 17:45:01 akmodsbuild: from ./include/linux/sched.h:14,
2019/11/16 17:45:01 akmodsbuild: from ./include/linux/utsname.h:6,
2019/11/16 17:45:01 akmodsbuild: from /tmp/akmodsbuild.BDZemvCW/BUILD/nvidia-340xx-kmod-340.107/_kmod_build_5.3.11-200.fc30.x86_64/nv-linux.h:44,
2019/11/16 17:45:01 akmodsbuild: from /tmp/akmodsbuild.BDZemvCW/BUILD/nvidia-340xx-kmod-340.107/_kmod_build_5.3.11-200.fc30.x86_64/nv-dma.c:15:
2019/11/16 17:45:01 akmodsbuild: ./include/linux/vmstat.h: In function 'zone_numa_state_snapshot':
2019/11/16 17:45:01 akmodsbuild: ./include/linux/cpumask.h:243:9: warning: comparison of integer expressions of different signedness: 'int' and 'unsigned int' [-Wsign-compare]
2019/11/16 17:45:01 akmodsbuild: 243 |   (cpu) < nr_cpu_ids;)
2019/11/16 17:45:01 akmodsbuild: |         ^
2019/11/16 17:45:01 akmodsbuild: ./include/linux/cpumask.h:777:36: note: in expansion of macro 'for_each_cpu'
2019/11/16 17:45:01 akmodsbuild: 777 | #define for_each_online_cpu(cpu)   for_each_cpu((cpu), cpu_online_mask)
2019/11/16 17:45:01 akmodsbuild: |                                    ^~~~~~~~~~~~
2019/11/16 17:45:01 akmodsbuild: ./include/linux/vmstat.h:156:2: note: in expansion of macro 'for_each_online_cpu'
2019/11/16 17:45:01 akmodsbuild: 156 |  for_each_online_cpu(cpu)
2019/11/16 17:45:01 akmodsbuild: |  ^~~~~~~~~~~~~~~~~~~
2019/11/16 17:45:01 akmodsbuild: ./include/linux/vmstat.h: In function 'zone_page_state_snapshot':
2019/11/16 17:45:01 akmodsbuild: ./include/linux/cpumask.h:243:9: warning: comparison of integer expressions of different signedness: 'int' and 'unsigned int' [-Wsign-compare]
2019/11/16 17:45:01 akmodsbuild: 243 |   (cpu) < nr_cpu_ids;)
2019/11/16 17:45:01 akmodsbuild: |         ^
2019/11/16 17:45:01 akmodsbuild: ./include/linux/cpumask.h:777:36: note: in expansion of macro 'for_each_cpu'
2019/11/16 17:45:01 akmodsbuild: 777 | #define for_each_online_cpu(cpu)   for_each_cpu((cpu), cpu_online_mask)
2019/11/16 17:45:01 akmodsbuild: |                                    ^~~~~~~~~~~~
2019/11/16 17:45:01 akmodsbuild: ./include/linux/vmstat.h:221:2: note: in expansion of macro 'for_each_online_cpu'
2019/11/16 17:45:01 akmodsbuild: 221 |  for_each_online_cpu(cpu)
2019/11/16 17:45:01 akmodsbuild: |  ^~~~~~~~~~~~~~~~~~~
2019/11/16 17:45:01 akmodsbuild: In file included from ./arch/x86/include/asm/paravirt.h:17,
2019/11/16 17:45:01 akmodsbuild: from ./arch/x86/include/asm/irqflags.h:72,
2019/11/16 17:45:01 akmodsbuild: from ./include/linux/irqflags.h:16,
2019/11/16 17:45:01 akmodsbuild: from ./include/linux/rcupdate.h:26,
2019/11/16 17:45:01 akmodsbuild: from ./include/linux/rculist.h:11,
2019/11/16 17:45:01 akmodsbuild: from ./include/linux/pid.h:5,
2019/11/16 17:45:01 akmodsbuild: from ./include/linux/sched.h:14,
2019/11/16 17:45:01 akmodsbuild: from ./include/linux/utsname.h:6,
2019/11/16 17:45:01 akmodsbuild: from /tmp/akmodsbuild.BDZemvCW/BUILD/nvidia-340xx-kmod-340.107/_kmod_build_5.3.11-200.fc30.x86_64/nv-linux.h:44,
2019/11/16 17:45:01 akmodsbuild: from /tmp/akmodsbuild.BDZemvCW/BUILD/nvidia-340xx-kmod-340.107/_kmod_build_5.3.11-200.fc30.x86_64/nv-acpi.c:15:
2019/11/16 17:45:01 akmodsbuild: ./include/linux/vmstat.h: In function 'zone_numa_state_snapshot':
2019/11/16 17:45:01 akmodsbuild: ./include/linux/cpumask.h:243:9: warning: comparison of integer expressions of different signedness: 'int' and 'unsigned int' [-Wsign-compare]
2019/11/16 17:45:01 akmodsbuild: 243 |   (cpu) < nr_cpu_ids;)
2019/11/16 17:45:01 akmodsbuild: |         ^
2019/11/16 17:45:01 akmodsbuild: ./include/linux/cpumask.h:777:36: note: in expansion of macro 'for_each_cpu'
2019/11/16 17:45:01 akmodsbuild: 777 | #define for_each_online_cpu(cpu)   for_each_cpu((cpu), cpu_online_mask)
2019/11/16 17:45:01 akmodsbuild: |                                    ^~~~~~~~~~~~
2019/11/16 17:45:01 akmodsbuild: ./include/linux/vmstat.h:156:2: note: in expansion of macro 'for_each_online_cpu'
2019/11/16 17:45:01 akmodsbuild: 156 |  for_each_online_cpu(cpu)
2019/11/16 17:45:01 akmodsbuild: |  ^~~~~~~~~~~~~~~~~~~
2019/11/16 17:45:01 akmodsbuild: ./include/linux/vmstat.h: In function 'zone_page_state_snapshot':
2019/11/16 17:45:01 akmodsbuild: ./include/linux/cpumask.h:243:9: warning: comparison of integer expressions of different signedness: 'int' and 'unsigned int' [-Wsign-compare]
2019/11/16 17:45:01 akmodsbuild: 243 |   (cpu) < nr_cpu_ids;)
2019/11/16 17:45:01 akmodsbuild: |         ^
2019/11/16 17:45:01 akmodsbuild: ./include/linux/cpumask.h:777:36: note: in expansion of macro 'for_each_cpu'
2019/11/16 17:45:01 akmodsbuild: 777 | #define for_each_online_cpu(cpu)   for_each_cpu((cpu), cpu_online_mask)
2019/11/16 17:45:01 akmodsbuild: |                                    ^~~~~~~~~~~~
2019/11/16 17:45:01 akmodsbuild: ./include/linux/vmstat.h:221:2: note: in expansion of macro 'for_each_online_cpu'
2019/11/16 17:45:01 akmodsbuild: 221 |  for_each_online_cpu(cpu)
2019/11/16 17:45:01 akmodsbuild: |  ^~~~~~~~~~~~~~~~~~~
2019/11/16 17:45:01 akmodsbuild: In file included from ./include/linux/efi.h:20,
2019/11/16 17:45:01 akmodsbuild: from /tmp/akmodsbuild.BDZemvCW/BUILD/nvidia-340xx-kmod-340.107/_kmod_build_5.3.11-200.fc30.x86_64/nv-linux.h:173,
2019/11/16 17:45:01 akmodsbuild: from /tmp/akmodsbuild.BDZemvCW/BUILD/nvidia-340xx-kmod-340.107/_kmod_build_5.3.11-200.fc30.x86_64/nv-chrdev.c:15:
2019/11/16 17:45:01 akmodsbuild: ./include/linux/rtc.h: In function 'rtc_tv_nsec_ok':
2019/11/16 17:45:01 akmodsbuild: ./include/linux/rtc.h:238:22: warning: comparison of integer expressions of different signedness: 'long int' and 'long unsigned int' [-Wsign-compare]
2019/11/16 17:45:01 akmodsbuild: 238 |  if (to_set->tv_nsec < TIME_SET_NSEC_FUZZ) {
2019/11/16 17:45:01 akmodsbuild: |                      ^
2019/11/16 17:45:01 akmodsbuild: ./include/linux/rtc.h:243:22: warning: comparison of integer expressions of different signedness: 'long int' and 'long unsigned int' [-Wsign-compare]
2019/11/16 17:45:01 akmodsbuild: 243 |  if (to_set->tv_nsec > NSEC_PER_SEC - TIME_SET_NSEC_FUZZ) {
2019/11/16 17:45:01 akmodsbuild: |                      ^
2019/11/16 17:45:01 akmodsbuild: In file included from ./include/linux/efi.h:20,
2019/11/16 17:45:01 akmodsbuild: from /tmp/akmodsbuild.BDZemvCW/BUILD/nvidia-340xx-kmod-340.107/_kmod_build_5.3.11-200.fc30.x86_64/nv-linux.h:173,
2019/11/16 17:45:01 akmodsbuild: from /tmp/akmodsbuild.BDZemvCW/BUILD/nvidia-340xx-kmod-340.107/_kmod_build_5.3.11-200.fc30.x86_64/nv-cray.c:15:
2019/11/16 17:45:01 akmodsbuild: ./include/linux/rtc.h: In function 'rtc_tv_nsec_ok':
2019/11/16 17:45:01 akmodsbuild: ./include/linux/rtc.h:238:22: warning: comparison of integer expressions of different signedness: 'long int' and 'long unsigned int' [-Wsign-compare]
2019/11/16 17:45:01 akmodsbuild: 238 |  if (to_set->tv_nsec < TIME_SET_NSEC_FUZZ) {
2019/11/16 17:45:01 akmodsbuild: |                      ^
2019/11/16 17:45:01 akmodsbuild: ./include/linux/rtc.h:243:22: warning: comparison of integer expressions of different signedness: 'long int' and 'long unsigned int' [-Wsign-compare]
2019/11/16 17:45:01 akmodsbuild: 243 |  if (to_set->tv_nsec > NSEC_PER_SEC - TIME_SET_NSEC_FUZZ) {
2019/11/16 17:45:01 akmodsbuild: |                      ^
2019/11/16 17:45:01 akmodsbuild: In file included from ./include/linux/efi.h:20,
2019/11/16 17:45:01 akmodsbuild: from /tmp/akmodsbuild.BDZemvCW/BUILD/nvidia-340xx-kmod-340.107/_kmod_build_5.3.11-200.fc30.x86_64/nv-linux.h:173,
2019/11/16 17:45:01 akmodsbuild: from /tmp/akmodsbuild.BDZemvCW/BUILD/nvidia-340xx-kmod-340.107/_kmod_build_5.3.11-200.fc30.x86_64/nv-dma.c:15:
2019/11/16 17:45:01 akmodsbuild: ./include/linux/rtc.h: In function 'rtc_tv_nsec_ok':
2019/11/16 17:45:01 akmodsbuild: ./include/linux/rtc.h:238:22: warning: comparison of integer expressions of different signedness: 'long int' and 'long unsigned int' [-Wsign-compare]
2019/11/16 17:45:01 akmodsbuild: 238 |  if (to_set->tv_nsec < TIME_SET_NSEC_FUZZ) {
2019/11/16 17:45:01 akmodsbuild: |                      ^
2019/11/16 17:45:01 akmodsbuild: ./include/linux/rtc.h:243:22: warning: comparison of integer expressions of different signedness: 'long int' and 'long unsigned int' [-Wsign-compare]
2019/11/16 17:45:01 akmodsbuild: 243 |  if (to_set->tv_nsec > NSEC_PER_SEC - TIME_SET_NSEC_FUZZ) {
2019/11/16 17:45:01 akmodsbuild: |                      ^
2019/11/16 17:45:01 akmodsbuild: In file included from ./include/linux/efi.h:20,
2019/11/16 17:45:01 akmodsbuild: from /tmp/akmodsbuild.BDZemvCW/BUILD/nvidia-340xx-kmod-340.107/_kmod_build_5.3.11-200.fc30.x86_64/nv-linux.h:173,
2019/11/16 17:45:01 akmodsbuild: from /tmp/akmodsbuild.BDZemvCW/BUILD/nvidia-340xx-kmod-340.107/_kmod_build_5.3.11-200.fc30.x86_64/nv-acpi.c:15:
2019/11/16 17:45:01 akmodsbuild: ./include/linux/rtc.h: In function 'rtc_tv_nsec_ok':
2019/11/16 17:45:01 akmodsbuild: ./include/linux/rtc.h:238:22: warning: comparison of integer expressions of different signedness: 'long int' and 'long unsigned int' [-Wsign-compare]
2019/11/16 17:45:01 akmodsbuild: 238 |  if (to_set->tv_nsec < TIME_SET_NSEC_FUZZ) {
2019/11/16 17:45:01 akmodsbuild: |                      ^
2019/11/16 17:45:01 akmodsbuild: ./include/linux/rtc.h:243:22: warning: comparison of integer expressions of different signedness: 'long int' and 'long unsigned int' [-Wsign-compare]
2019/11/16 17:45:01 akmodsbuild: 243 |  if (to_set->tv_nsec > NSEC_PER_SEC - TIME_SET_NSEC_FUZZ) {
2019/11/16 17:45:01 akmodsbuild: |                      ^
2019/11/16 17:45:01 akmodsbuild: In file included from /tmp/akmodsbuild.BDZemvCW/BUILD/nvidia-340xx-kmod-340.107/_kmod_build_5.3.11-200.fc30.x86_64/nv-chrdev.c:15:
2019/11/16 17:45:01 akmodsbuild: /tmp/akmodsbuild.BDZemvCW/BUILD/nvidia-340xx-kmod-340.107/_kmod_build_5.3.11-200.fc30.x86_64/nv-linux.h: In function 'nv_execute_on_all_cpus':
2019/11/16 17:45:01 akmodsbuild: /tmp/akmodsbuild.BDZemvCW/BUILD/nvidia-340xx-kmod-340.107/_kmod_build_5.3.11-200.fc30.x86_64/nv-linux.h:903:21: error: void value not ignored as it ought to be
2019/11/16 17:45:01 akmodsbuild: 903 |         int __ret = on_each_cpu(func, info, wait);           |                     ^~~~~~~~~~~
2019/11/16 17:45:01 akmodsbuild: /tmp/akmodsbuild.BDZemvCW/BUILD/nvidia-340xx-kmod-340.107/_kmod_build_5.3.11-200.fc30.x86_64/nv-linux.h:919:11: note: in expansion of macro 'NV_ON_EACH_CPU'
2019/11/16 17:45:01 akmodsbuild: 919 |     ret = NV_ON_EACH_CPU(func, info, 1);
2019/11/16 17:45:01 akmodsbuild: |           ^~~~~~~~~~~~~~
2019/11/16 17:45:01 akmodsbuild: make[2]: *** [scripts/Makefile.build:281: /tmp/akmodsbuild.BDZemvCW/BUILD/nvidia-340xx-kmod-340.107/_kmod_build_5.3.11-200.fc30.x86_64/nv-chrdev.o] Error 1
2019/11/16 17:45:01 akmodsbuild: make[2]: *** Waiting for unfinished jobs....
2019/11/16 17:45:01 akmodsbuild: In file included from /tmp/akmodsbuild.BDZemvCW/BUILD/nvidia-340xx-kmod-340.107/_kmod_build_5.3.11-200.fc30.x86_64/nv-cray.c:15:
2019/11/16 17:45:01 akmodsbuild: /tmp/akmodsbuild.BDZemvCW/BUILD/nvidia-340xx-kmod-340.107/_kmod_build_5.3.11-200.fc30.x86_64/nv-linux.h: In function 'nv_execute_on_all_cpus':
2019/11/16 17:45:01 akmodsbuild: /tmp/akmodsbuild.BDZemvCW/BUILD/nvidia-340xx-kmod-340.107/_kmod_build_5.3.11-200.fc30.x86_64/nv-linux.h:903:21: error: void value not ignored as it ought to be
2019/11/16 17:45:01 akmodsbuild: 903 |         int __ret = on_each_cpu(func, info, wait);           |                     ^~~~~~~~~~~
2019/11/16 17:45:01 akmodsbuild: /tmp/akmodsbuild.BDZemvCW/BUILD/nvidia-340xx-kmod-340.107/_kmod_build_5.3.11-200.fc30.x86_64/nv-linux.h:919:11: note: in expansion of macro 'NV_ON_EACH_CPU'
2019/11/16 17:45:01 akmodsbuild: 919 |     ret = NV_ON_EACH_CPU(func, info, 1);
2019/11/16 17:45:01 akmodsbuild: |           ^~~~~~~~~~~~~~
2019/11/16 17:45:01 akmodsbuild: In file included from /tmp/akmodsbuild.BDZemvCW/BUILD/nvidia-340xx-kmod-340.107/_kmod_build_5.3.11-200.fc30.x86_64/nv-dma.c:15:
2019/11/16 17:45:01 akmodsbuild: /tmp/akmodsbuild.BDZemvCW/BUILD/nvidia-340xx-kmod-340.107/_kmod_build_5.3.11-200.fc30.x86_64/nv-linux.h: In function 'nv_execute_on_all_cpus':
2019/11/16 17:45:01 akmodsbuild: /tmp/akmodsbuild.BDZemvCW/BUILD/nvidia-340xx-kmod-340.107/_kmod_build_5.3.11-200.fc30.x86_64/nv-linux.h:903:21: error: void value not ignored as it ought to be
2019/11/16 17:45:01 akmodsbuild: 903 |         int __ret = on_each_cpu(func, info, wait);           |                     ^~~~~~~~~~~
2019/11/16 17:45:01 akmodsbuild: /tmp/akmodsbuild.BDZemvCW/BUILD/nvidia-340xx-kmod-340.107/_kmod_build_5.3.11-200.fc30.x86_64/nv-linux.h:919:11: note: in expansion of macro 'NV_ON_EACH_CPU'
2019/11/16 17:45:01 akmodsbuild: 919 |     ret = NV_ON_EACH_CPU(func, info, 1);
2019/11/16 17:45:01 akmodsbuild: |           ^~~~~~~~~~~~~~
2019/11/16 17:45:01 akmodsbuild: make[2]: *** [scripts/Makefile.build:281: /tmp/akmodsbuild.BDZemvCW/BUILD/nvidia-340xx-kmod-340.107/_kmod_build_5.3.11-200.fc30.x86_64/nv-cray.o] Error 1
2019/11/16 17:45:01 akmodsbuild: In file included from /tmp/akmodsbuild.BDZemvCW/BUILD/nvidia-340xx-kmod-340.107/_kmod_build_5.3.11-200.fc30.x86_64/nv-acpi.c:15:
2019/11/16 17:45:01 akmodsbuild: /tmp/akmodsbuild.BDZemvCW/BUILD/nvidia-340xx-kmod-340.107/_kmod_build_5.3.11-200.fc30.x86_64/nv-linux.h: In function 'nv_execute_on_all_cpus':
2019/11/16 17:45:02 akmodsbuild: /tmp/akmodsbuild.BDZemvCW/BUILD/nvidia-340xx-kmod-340.107/_kmod_build_5.3.11-200.fc30.x86_64/nv-linux.h:903:21: error: void value not ignored as it ought to be
2019/11/16 17:45:02 akmodsbuild: 903 |         int __ret = on_each_cpu(func, info, wait);           |                     ^~~~~~~~~~~
2019/11/16 17:45:02 akmodsbuild: /tmp/akmodsbuild.BDZemvCW/BUILD/nvidia-340xx-kmod-340.107/_kmod_build_5.3.11-200.fc30.x86_64/nv-linux.h:919:11: note: in expansion of macro 'NV_ON_EACH_CPU'
2019/11/16 17:45:02 akmodsbuild: 919 |     ret = NV_ON_EACH_CPU(func, info, 1);
2019/11/16 17:45:02 akmodsbuild: |           ^~~~~~~~~~~~~~
2019/11/16 17:45:02 akmodsbuild: make[2]: *** [scripts/Makefile.build:281: /tmp/akmodsbuild.BDZemvCW/BUILD/nvidia-340xx-kmod-340.107/_kmod_build_5.3.11-200.fc30.x86_64/nv-dma.o] Error 1
2019/11/16 17:45:02 akmodsbuild: make[2]: *** [scripts/Makefile.build:281: /tmp/akmodsbuild.BDZemvCW/BUILD/nvidia-340xx-kmod-340.107/_kmod_build_5.3.11-200.fc30.x86_64/nv-acpi.o] Error 1
2019/11/16 17:45:02 akmodsbuild: make[1]: *** [Makefile:1630: _module_/tmp/akmodsbuild.BDZemvCW/BUILD/nvidia-340xx-kmod-340.107/_kmod_build_5.3.11-200.fc30.x86_64] Error 2
2019/11/16 17:45:02 akmodsbuild: make[1]: Leaving directory '/usr/src/kernels/5.3.11-200.fc30.x86_64'
2019/11/16 17:45:02 akmodsbuild: NVIDIA: left KBUILD.
2019/11/16 17:45:02 akmodsbuild: nvidia.ko failed to build!
2019/11/16 17:45:02 akmodsbuild: make: *** [Makefile:194: nvidia.ko] Error 1
2019/11/16 17:45:02 akmodsbuild: erreur : Mauvais statut de sortie pour /var/tmp/rpm-tmp.gU4ArL (%build)
2019/11/16 17:45:02 akmodsbuild: 
2019/11/16 17:45:02 akmodsbuild: 
2019/11/16 17:45:02 akmodsbuild: Erreur de construction de RPM :
2019/11/16 17:45:02 akmodsbuild: user mockbuild does not exist - using root
2019/11/16 17:45:02 akmodsbuild: group mock does not exist - using root
2019/11/16 17:45:02 akmodsbuild: user mockbuild does not exist - using root
2019/11/16 17:45:02 akmodsbuild: group mock does not exist - using root
2019/11/16 17:45:02 akmodsbuild: user mockbuild does not exist - using root
2019/11/16 17:45:02 akmodsbuild: group mock does not exist - using root
2019/11/16 17:45:02 akmodsbuild: user mockbuild does not exist - using root
2019/11/16 17:45:02 akmodsbuild: group mock does not exist - using root
2019/11/16 17:45:02 akmodsbuild: user mockbuild does not exist - using root
2019/11/16 17:45:02 akmodsbuild: group mock does not exist - using root
2019/11/16 17:45:02 akmodsbuild: Mauvais statut de sortie pour /var/tmp/rpm-tmp.gU4ArL (%build)
2019/11/16 17:45:02 akmodsbuild: 
2019/11/16 17:45:02 akmods: Building rpms failed; see /var/cache/akmods/nvidia-340xx/340.107-8-for-5.3.11-200.fc30.x86_64.failed.log for details

Dell Alienware m11x R2, core i5 - NVIDIA Corporation GT215M [GeForce GT 335M] (rev a2)
Dual boot Windows 10 / Linux Fedora 34  - x86_64 x86_64 x86_64

Hors ligne

#10 16/11/2019 19:38:30

didierg
Modérateur
Modérateur
Inscription : 11/07/2005
Messages : 5 530

Re : Problème suite à l'installation du pilote proprio fourni par RPMFusion

Hors ligne

#11 16/11/2019 21:31:15

Nicosss
Rédacteur Wiki
Rédacteur Wiki
Lieu : Isère
Inscription : 05/03/2007
Messages : 6 493
Site Web

Re : Problème suite à l'installation du pilote proprio fourni par RPMFusion

didierg a écrit :

Il faudrait mettre l'information dans https://doc.fedora-fr.org/wiki/Carte_gr … 3%A9taires

Fait.


F34_64 Gnome-Shell - GA-990FXA-UD3 - Phenom II X6 1100T - NH-D14 - Ati HD 5750 Fanless - 16Go RAM /&/ F33_64 Gnome-Shell - Toshiba Satellite C660D-19X - 8Go RAM
F33_64 - ASRock 960GC-GS FX - AMD FX(tm)-8300 - 16Go RAM

Hors ligne

#12 17/11/2019 22:31:34

fedora23
Membre
Inscription : 21/06/2016
Messages : 87

Re : Problème suite à l'installation du pilote proprio fourni par RPMFusion

Nicosss a écrit :
didierg a écrit :

Il faudrait mettre l'information dans https://doc.fedora-fr.org/wiki/Carte_gr … 3%A9taires

Fait.

Le lien m'amène juste sur la doc, comment t'as fais pour mettre l'information sur ce lien ? (Je n'ai pas trop compris ce qu'il fallait faire)


Dell Alienware m11x R2, core i5 - NVIDIA Corporation GT215M [GeForce GT 335M] (rev a2)
Dual boot Windows 10 / Linux Fedora 34  - x86_64 x86_64 x86_64

Hors ligne

#13 17/11/2019 23:47:48

Nicosss
Rédacteur Wiki
Rédacteur Wiki
Lieu : Isère
Inscription : 05/03/2007
Messages : 6 493
Site Web

Re : Problème suite à l'installation du pilote proprio fourni par RPMFusion

fedora23 a écrit :
Nicosss a écrit :
didierg a écrit :

Il faudrait mettre l'information dans https://doc.fedora-fr.org/wiki/Carte_gr … 3%A9taires

Fait.

Le lien m'amène juste sur la doc, comment t'as fais pour mettre l'information sur ce lien ? (Je n'ai pas trop compris ce qu'il fallait faire)

Moi je suis rédacteur de la Documentation. Toi tu n'avais rien à faire, ou au pire essayer ce qu'il a été proposé dans le rapport de bug.


F34_64 Gnome-Shell - GA-990FXA-UD3 - Phenom II X6 1100T - NH-D14 - Ati HD 5750 Fanless - 16Go RAM /&/ F33_64 Gnome-Shell - Toshiba Satellite C660D-19X - 8Go RAM
F33_64 - ASRock 960GC-GS FX - AMD FX(tm)-8300 - 16Go RAM

Hors ligne

#14 18/11/2019 00:09:24

fedora23
Membre
Inscription : 21/06/2016
Messages : 87

Re : Problème suite à l'installation du pilote proprio fourni par RPMFusion

Nicosss a écrit :
fedora23 a écrit :
Nicosss a écrit :

Fait.

Le lien m'amène juste sur la doc, comment t'as fais pour mettre l'information sur ce lien ? (Je n'ai pas trop compris ce qu'il fallait faire)

Moi je suis rédacteur de la Documentation. Toi tu n'avais rien à faire, ou au pire essayer ce qu'il a été proposé dans le rapport de bug.

Ok, ça marche.

Je survole ce qu'il a été proposé dans le rapport de bug, cela fait pas mal de lecture et il me faut du temps pour comprendre, je posterai la suite dès que possible


Dell Alienware m11x R2, core i5 - NVIDIA Corporation GT215M [GeForce GT 335M] (rev a2)
Dual boot Windows 10 / Linux Fedora 34  - x86_64 x86_64 x86_64

Hors ligne

Pied de page des forums