Suite à la mise à jour du kernel de ce jour, j'ai une erreur lors de la construction du kmod-nvidia-304xx à partir du akmod.

Any help ?
kernel-headers-3.10.3-300.fc19.i686
kernel-PAE-3.10.3-300.fc19.i686
kernel-PAE-3.9.5-301.fc19.i686
kernel-PAE-3.9.9-302.fc19.i686
kernel-PAE-devel-3.10.3-300.fc19.i686
kernel-PAE-devel-3.9.9-302.fc19.i686
kernel-PAE-modules-extra-3.10.3-300.fc19.i686
kernel-PAE-modules-extra-3.9.5-301.fc19.i686
kernel-PAE-modules-extra-3.9.9-302.fc19.i686
akmod-nvidia-304xx-304.88-1.fc19.3.i686
kmod-nvidia-304xx-3.9.9-302.fc19.i686.PAE-304.88-1.fc19.7.i686
kmod-nvidia-304xx-PAE-304.88-1.fc19.7.i686
xorg-x11-drv-nvidia-304xx-304.88-12.fc19.i686
xorg-x11-drv-nvidia-304xx-libs-304.88-12.fc19.i686
27 juil. 12:30:38 akmods: Building RPM using the command '/bin/akmodsbuild --target i686 --kernels 3.10.3-300.fc19.i686.PAE /usr/src/akmods/nvidia-304xx-kmod.latest'
                 from include/linux/utsname.h:5,
                 from /tmp/akmodsbuild.ONiVGc0h/BUILD/nvidia-304xx-kmod-304.88/_kmod_build_3.10.3-300.fc19.i686.PAE/kernel/nv-linux.h:40,
                 from /tmp/akmodsbuild.ONiVGc0h/BUILD/nvidia-304xx-kmod-304.88/_kmod_build_3.10.3-300.fc19.i686.PAE/kernel/nv-i2c.c:15:
/usr/src/kernels/3.10.3-300.fc19.i686.PAE/arch/x86/include/asm/uaccess_32.h: In function 'copy_from_user':
/usr/src/kernels/3.10.3-300.fc19.i686.PAE/arch/x86/include/asm/uaccess_32.h:208:28: warning: comparison between signed and unsigned integer expressions [-Wsign-compare]
  if (likely(sz == -1 || sz >= n))
                            ^
include/linux/compiler.h:152:40: note: in definition of macro 'likely'
 # define likely(x) __builtin_expect(!!(x), 1)
                                        ^
/tmp/akmodsbuild.ONiVGc0h/BUILD/nvidia-304xx-kmod-304.88/_kmod_build_3.10.3-300.fc19.i686.PAE/kernel/nv-i2c.c: In function 'nv_i2c_del_adapter':
/tmp/akmodsbuild.ONiVGc0h/BUILD/nvidia-304xx-kmod-304.88/_kmod_build_3.10.3-300.fc19.i686.PAE/kernel/nv-i2c.c:327:14: error: void value not ignored as it ought to be
     osstatus = i2c_del_adapter(pI2cAdapter);
              ^
make[3]: *** [/tmp/akmodsbuild.ONiVGc0h/BUILD/nvidia-304xx-kmod-304.88/_kmod_build_3.10.3-300.fc19.i686.PAE/kernel/nv-i2c.o] Error 1
make[3]: *** Waiting for unfinished jobs....
  if [ "-pg" = "-pg" ]; then if [ /tmp/akmodsbuild.ONiVGc0h/BUILD/nvidia-304xx-kmod-304.88/_kmod_build_3.10.3-300.fc19.i686.PAE/kernel/nv-gvi.o != "scripts/mod/empty.o" ]; then /usr/src/kernels/3.10.3-300.fc19.i686.PAE/scripts/recordmcount  "/tmp/akmodsbuild.ONiVGc0h/BUILD/nvidia-304xx-kmod-304.88/_kmod_build_3.10.3-300.fc19.i686.PAE/kernel/nv-gvi.o"; fi; fi;
make[2]: *** [_module_/tmp/akmodsbuild.ONiVGc0h/BUILD/nvidia-304xx-kmod-304.88/_kmod_build_3.10.3-300.fc19.i686.PAE/kernel] Error 2
NVIDIA: left KBUILD.
nvidia.ko failed to build!
make[1]: *** [module] Error 1
make: *** [module] Error 2
erreur : Mauvais statut de sortie pour /var/tmp/rpm-tmp.wjEvLU (%build)


Erreur de construction de RPM :
    utilisateur mockbuild inexistant - utilisation de root
    groupe mockbuild inexistant - utilisation de root
    utilisateur mockbuild inexistant - utilisation de root
    groupe mockbuild inexistant - utilisation de root
    utilisateur mockbuild inexistant - utilisation de root
    groupe mockbuild inexistant - utilisation de root
    date incorrecte dans %changelog : Wed Jun 18 2010 Vallimar de Morieve <vallimar@gmail.com> - 1:256.35-1
    date incorrecte dans %changelog : Fri Mar  8 2008 kwizart < kwizart at gmail.com > - 171.06-1
    Mauvais statut de sortie pour /var/tmp/rpm-tmp.wjEvLU (%build)
27 juil. 12:30:52 akmodsbuild: * Rebuilding /usr/src/akmods/nvidia-304xx-kmod.latest for kernel(s) 3.10.3-300.fc19.i686.PAE: attention : utilisateur mockbuild inexistant - utilisation de root
27 juil. 12:30:52 akmodsbuild: attention : groupe mockbuild inexistant - utilisation de root
27 juil. 12:30:52 akmodsbuild: attention : utilisateur mockbuild inexistant - utilisation de root
27 juil. 12:30:52 akmodsbuild: attention : groupe mockbuild inexistant - utilisation de root
27 juil. 12:30:52 akmodsbuild: attention : utilisateur mockbuild inexistant - utilisation de root
27 juil. 12:30:52 akmodsbuild: attention : groupe mockbuild inexistant - utilisation de root
27 juil. 12:30:52 akmodsbuild: attention : date incorrecte dans %changelog : Wed Jun 18 2010 Vallimar de Morieve <vallimar@gmail.com> - 1:256.35-1
27 juil. 12:30:52 akmodsbuild: attention : date incorrecte dans %changelog : Fri Mar  8 2008 kwizart < kwizart at gmail.com > - 171.06-1
27 juil. 12:30:52 akmodsbuild: Installation de /usr/src/akmods/nvidia-304xx-kmod.latest
27 juil. 12:30:52 akmodsbuild: Construction pour plate-formes cibles: i686
27 juil. 12:30:52 akmodsbuild: Construction pour cible i686
27 juil. 12:30:52 akmodsbuild: Exécution_de(%prep) : /bin/sh -e /var/tmp/rpm-tmp.HBB53S
27 juil. 12:30:52 akmodsbuild: + umask 022
27 juil. 12:30:52 akmodsbuild: + cd /tmp/akmodsbuild.ONiVGc0h//BUILD
27 juil. 12:30:52 akmodsbuild: + kmodtool --target i686 --repo rpmfusion --kmodname nvidia-304xx-kmod --filterfile /tmp/akmodsbuild.ONiVGc0h/SOURCES/nvidia-304xx-kmodtool-excludekernel-filterfile --obsolete-name nvidia --obsolete-version 1:304.1000 --current --for-kernels 3.10.3-300.fc19.i686.PAE
27 juil. 12:30:52 akmodsbuild: %package       -n kmod-nvidia-304xx-3.10.3-300.fc19.i686.PAE
27 juil. 12:30:52 akmodsbuild: Summary:          nvidia-304xx kernel module(s) for 3.10.3-300.fc19.i686.PAE
27 juil. 12:30:52 akmodsbuild: Group:            System Environment/Kernel
27 juil. 12:30:52 akmodsbuild: Provides:         kernel-modules-for-kernel = 3.10.3-300.fc19.i686.PAE
27 juil. 12:30:52 akmodsbuild: Provides:         nvidia-304xx-kmod = %{?epoch:%{epoch}:}%{version}-%{release}
27 juil. 12:30:52 akmodsbuild: Requires:         nvidia-304xx-kmod-common >= %{?epoch:%{epoch}:}%{version}
27 juil. 12:30:52 akmodsbuild: Requires(post):   /usr/sbin/depmod
27 juil. 12:30:52 akmodsbuild: Requires(postun): /usr/sbin/depmod
27 juil. 12:30:52 akmodsbuild: Provides:        kmod-nvidia-3.10.3-300.fc19.i686.PAE = 1:304.1000
27 juil. 12:30:52 akmodsbuild: Obsoletes:       kmod-nvidia-3.10.3-300.fc19.i686.PAE < 1:304.1000
27 juil. 12:30:52 akmodsbuild: Requires:         kernel-uname-r = 3.10.3-300.fc19.i686.PAE
27 juil. 12:30:52 akmodsbuild: BuildRequires:	  kernel-devel-uname-r = 3.10.3-300.fc19.i686.PAE
27 juil. 12:30:52 akmodsbuild: %post          -n kmod-nvidia-304xx-3.10.3-300.fc19.i686.PAE
27 juil. 12:30:52 akmodsbuild: /usr/sbin/depmod -aeF /boot/System.map-3.10.3-300.fc19.i686.PAE 3.10.3-300.fc19.i686.PAE > /dev/null || :
27 juil. 12:30:52 akmodsbuild: %postun        -n kmod-nvidia-304xx-3.10.3-300.fc19.i686.PAE
27 juil. 12:30:52 akmodsbuild: /usr/sbin/depmod  -aF /boot/System.map-3.10.3-300.fc19.i686.PAE 3.10.3-300.fc19.i686.PAE &> /dev/null || :
27 juil. 12:30:52 akmodsbuild: 
27 juil. 12:30:52 akmodsbuild: %description  -n kmod-nvidia-304xx-3.10.3-300.fc19.i686.PAE
27 juil. 12:30:52 akmodsbuild: This package provides the nvidia-304xx kernel modules built for the Linux
27 juil. 12:30:52 akmodsbuild: kernel 3.10.3-300.fc19.i686.PAE for the %{_target_cpu} family of processors.
27 juil. 12:30:52 akmodsbuild: %files        -n kmod-nvidia-304xx-3.10.3-300.fc19.i686.PAE
27 juil. 12:30:52 akmodsbuild: %defattr(644,root,root,755)
27 juil. 12:30:52 akmodsbuild: %dir /usr/lib/modules/3.10.3-300.fc19.i686.PAE/extra
27 juil. 12:30:52 akmodsbuild: /usr/lib/modules/3.10.3-300.fc19.i686.PAE/extra/nvidia-304xx/
27 juil. 12:30:52 akmodsbuild: 
27 juil. 12:30:52 akmodsbuild: 
27 juil. 12:30:52 akmodsbuild: 
27 juil. 12:30:52 akmodsbuild: %global kmodinstdir_prefix  /usr/lib/modules/
27 juil. 12:30:52 akmodsbuild: %global kmodinstdir_postfix /extra/nvidia-304xx/
27 juil. 12:30:52 akmodsbuild: %global kernel_versions     3.10.3-300.fc19.i686.PAE___%{_usrsrc}/kernels/3.10.3-300.fc19.i686.PAE
27 juil. 12:30:53 akmodsbuild: 
27 juil. 12:30:53 akmodsbuild: + cd /tmp/akmodsbuild.ONiVGc0h/BUILD
27 juil. 12:30:53 akmodsbuild: + rm -rf nvidia-304xx-kmod-304.88
27 juil. 12:30:53 akmodsbuild: + /usr/bin/mkdir -p nvidia-304xx-kmod-304.88
27 juil. 12:30:53 akmodsbuild: + cd nvidia-304xx-kmod-304.88
27 juil. 12:30:53 akmodsbuild: + /usr/bin/xz -dc /tmp/akmodsbuild.ONiVGc0h/SOURCES/nvidia-kmod-data-304.88.tar.xz
27 juil. 12:30:53 akmodsbuild: + /usr/bin/tar -xf -
27 juil. 12:30:53 akmodsbuild: + STATUS=0
27 juil. 12:30:53 akmodsbuild: + '[' 0 -ne 0 ']'
27 juil. 12:30:53 akmodsbuild: + /usr/bin/chmod -Rf a+rX,u+w,g-w,o-w .
27 juil. 12:30:53 akmodsbuild: + for arch in x86 x64
27 juil. 12:30:53 akmodsbuild: + pushd nvidiapkg-x86
27 juil. 12:30:53 akmodsbuild: /tmp/akmodsbuild.ONiVGc0h/BUILD/nvidia-304xx-kmod-304.88/nvidiapkg-x86 /tmp/akmodsbuild.ONiVGc0h/BUILD/nvidia-304xx-kmod-304.88
27 juil. 12:30:53 akmodsbuild: + echo NoPatch
27 juil. 12:30:53 akmodsbuild: NoPatch
27 juil. 12:30:53 akmodsbuild: + popd
27 juil. 12:30:53 akmodsbuild: /tmp/akmodsbuild.ONiVGc0h/BUILD/nvidia-304xx-kmod-304.88
27 juil. 12:30:53 akmodsbuild: + for arch in x86 x64
27 juil. 12:30:53 akmodsbuild: + pushd nvidiapkg-x64
27 juil. 12:30:53 akmodsbuild: /tmp/akmodsbuild.ONiVGc0h/BUILD/nvidia-304xx-kmod-304.88/nvidiapkg-x64 /tmp/akmodsbuild.ONiVGc0h/BUILD/nvidia-304xx-kmod-304.88
27 juil. 12:30:53 akmodsbuild: + echo NoPatch
27 juil. 12:30:53 akmodsbuild: NoPatch
27 juil. 12:30:53 akmodsbuild: + popd
27 juil. 12:30:53 akmodsbuild: /tmp/akmodsbuild.ONiVGc0h/BUILD/nvidia-304xx-kmod-304.88
27 juil. 12:30:53 akmodsbuild: + for kernel_version in 3.10.3-300.fc19.i686.PAE___/usr/src/kernels/3.10.3-300.fc19.i686.PAE
27 juil. 12:30:53 akmodsbuild: + cp -a nvidiapkg-x86 _kmod_build_3.10.3-300.fc19.i686.PAE
27 juil. 12:30:53 akmodsbuild: + exit 0
27 juil. 12:30:53 akmodsbuild: Exécution_de(%build) : /bin/sh -e /var/tmp/rpm-tmp.wjEvLU
27 juil. 12:30:53 akmodsbuild: + umask 022
27 juil. 12:30:53 akmodsbuild: + cd /tmp/akmodsbuild.ONiVGc0h//BUILD
27 juil. 12:30:53 akmodsbuild: + cd nvidia-304xx-kmod-304.88
27 juil. 12:30:53 akmodsbuild: + for kernel_version in 3.10.3-300.fc19.i686.PAE___/usr/src/kernels/3.10.3-300.fc19.i686.PAE
27 juil. 12:30:53 akmodsbuild: + pushd _kmod_build_3.10.3-300.fc19.i686.PAE/kernel/
27 juil. 12:30:53 akmodsbuild: /tmp/akmodsbuild.ONiVGc0h/BUILD/nvidia-304xx-kmod-304.88/_kmod_build_3.10.3-300.fc19.i686.PAE/kernel /tmp/akmodsbuild.ONiVGc0h/BUILD/nvidia-304xx-kmod-304.88
27 juil. 12:30:53 akmodsbuild: + make -j2 SYSSRC=/usr/src/kernels/3.10.3-300.fc19.i686.PAE module
27 juil. 12:30:53 akmodsbuild: NVIDIA: calling KBUILD...
27 juil. 12:30:53 akmodsbuild: test -e include/generated/autoconf.h -a -e include/config/auto.conf || (		echo >&2;							echo >&2 "  ERROR: Kernel configuration is invalid.";		echo >&2 "         include/generated/autoconf.h or include/config/auto.conf are missing.";echo >&2 "         Run 'make oldconfig && make prepare' on kernel src to fix it.";	echo >&2 ;							/bin/false)
27 juil. 12:30:53 akmodsbuild: mkdir -p /tmp/akmodsbuild.ONiVGc0h/BUILD/nvidia-304xx-kmod-304.88/_kmod_build_3.10.3-300.fc19.i686.PAE/kernel/.tmp_versions ; rm -f /tmp/akmodsbuild.ONiVGc0h/BUILD/nvidia-304xx-kmod-304.88/_kmod_build_3.10.3-300.fc19.i686.PAE/kernel/.tmp_versions/*
27 juil. 12:30:53 akmodsbuild: make -f scripts/Makefile.build obj=/tmp/akmodsbuild.ONiVGc0h/BUILD/nvidia-304xx-kmod-304.88/_kmod_build_3.10.3-300.fc19.i686.PAE/kernel
27 juil. 12:30:53 akmodsbuild: (cat /dev/null;   echo kernel//tmp/akmodsbuild.ONiVGc0h/BUILD/nvidia-304xx-kmod-304.88/_kmod_build_3.10.3-300.fc19.i686.PAE/kernel/nvidia.ko;) > /tmp/akmodsbuild.ONiVGc0h/BUILD/nvidia-304xx-kmod-304.88/_kmod_build_3.10.3-300.fc19.i686.PAE/kernel/modules.order
27 juil. 12:30:53 akmodsbuild: cc -Wp,-MD,/tmp/akmodsbuild.ONiVGc0h/BUILD/nvidia-304xx-kmod-304.88/_kmod_build_3.10.3-300.fc19.i686.PAE/kernel/.nv.o.d  -nostdinc -isystem /usr/lib/gcc/i686-redhat-linux/4.8.1/include -I/usr/src/kernels/3.10.3-300.fc19.i686.PAE/arch/x86/include -Iarch/x86/include/generated  -Iinclude -I/usr/src/kernels/3.10.3-300.fc19.i686.PAE/arch/x86/include/uapi -Iarch/x86/include/generated/uapi -I/usr/src/kernels/3.10.3-300.fc19.i686.PAE/include/uapi -Iinclude/generated/uapi -include /usr/src/kernels/3.10.3-300.fc19.i686.PAE/include/linux/kconfig.h -D__KERNEL__ -Wall -Wundef -Wstrict-prototypes -Wno-trigraphs -fno-strict-aliasing -fno-common -Werror-implicit-function-declaration -Wno-format-security -fno-delete-null-pointer-checks -O2 -m32 -msoft-float -mregparm=3 -freg-struct-return -fno-pic -mpreferred-stack-boundary=2 -march=i686 -mtune=generic -maccumulate-outgoing-args -Wa,-mtune=generic32 -ffreestanding -fstack-protector -DCONFIG_AS_CFI=1 -DCONFIG_AS_CFI_SIGNAL_FRAME=1 -DCONFIG_AS_CFI_SECTIONS=1 -DCONFIG_AS_AVX=1 -DCONFIG_AS_AVX2=1 -pipe -Wno-sign-compare -fno-asynchronous-unwind-tables -mno-sse -mno-mmx -mno-sse2 -mno-3dnow -mno-avx -Wframe-larger-than=1024 -Wno-unused-but-set-variable -fno-omit-frame-pointer -fno-optimize-sibling-calls -g -pg -Wdeclaration-after-statement -Wno-pointer-sign -fno-strict-overflow -fconserve-stack -DCC_HAVE_ASM_GOTO -I/tmp/akmodsbuild.ONiVGc0h/BUILD/nvidia-304xx-kmod-304.88/_kmod_build_3.10.3-300.fc19.i686.PAE/kernel -Wall -MD -Wsign-compare -Wno-cast-qual -Wno-error -D__KERNEL__ -DMODULE -DNVRM -DNV_VERSION_STRING="304.88" -Wno-unused-function -Wuninitialized -UDEBUG -U_DEBUG -DNDEBUG  -DMODULE  -D"KBUILD_STR(s)=#s" -D"KBUILD_BASENAME=KBUILD_STR(nv)"  -D"KBUILD_MODNAME=KBUILD_STR(nvidia)" -c -o /tmp/akmodsbuild.ONiVGc0h/BUILD/nvidia-304xx-kmod-304.88/_kmod_build_3.10.3-300.fc19.i686.PAE/kernel/nv.o /tmp/akmodsbuild.ONiVGc0h/BUILD/nvidia-304xx-kmod-304.88/_kmod_build_3.10.3-300.fc19.i686.PAE/kernel/nv.c
27 juil. 12:30:53 akmodsbuild: cc -Wp,-MD,/tmp/akmodsbuild.ONiVGc0h/BUILD/nvidia-304xx-kmod-304.88/_kmod_build_3.10.3-300.fc19.i686.PAE/kernel/.nv-acpi.o.d  -nostdinc -isystem /usr/lib/gcc/i686-redhat-linux/4.8.1/include -I/usr/src/kernels/3.10.3-300.fc19.i686.PAE/arch/x86/include -Iarch/x86/include/generated  -Iinclude -I/usr/src/kernels/3.10.3-300.fc19.i686.PAE/arch/x86/include/uapi -Iarch/x86/include/generated/uapi -I/usr/src/kernels/3.10.3-300.fc19.i686.PAE/include/uapi -Iinclude/generated/uapi -include /usr/src/kernels/3.10.3-300.fc19.i686.PAE/include/linux/kconfig.h -D__KERNEL__ -Wall -Wundef -Wstrict-prototypes -Wno-trigraphs -fno-strict-aliasing -fno-common -Werror-implicit-function-declaration -Wno-format-security -fno-delete-null-pointer-checks -O2 -m32 -msoft-float -mregparm=3 -freg-struct-return -fno-pic -mpreferred-stack-boundary=2 -march=i686 -mtune=generic -maccumulate-outgoing-args -Wa,-mtune=generic32 -ffreestanding -fstack-protector -DCONFIG_AS_CFI=1 -DCONFIG_AS_CFI_SIGNAL_FRAME=1 -DCONFIG_AS_CFI_SECTIONS=1 -DCONFIG_AS_AVX=1 -DCONFIG_AS_AVX2=1 -pipe -Wno-sign-compare -fno-asynchronous-unwind-tables -mno-sse -mno-mmx -mno-sse2 -mno-3dnow -mno-avx -Wframe-larger-than=1024 -Wno-unused-but-set-variable -fno-omit-frame-pointer -fno-optimize-sibling-calls -g -pg -Wdeclaration-after-statement -Wno-pointer-sign -fno-strict-overflow -fconserve-stack -DCC_HAVE_ASM_GOTO -I/tmp/akmodsbuild.ONiVGc0h/BUILD/nvidia-304xx-kmod-304.88/_kmod_build_3.10.3-300.fc19.i686.PAE/kernel -Wall -MD -Wsign-compare -Wno-cast-qual -Wno-error -D__KERNEL__ -DMODULE -DNVRM -DNV_VERSION_STRING="304.88" -Wno-unused-function -Wuninitialized -UDEBUG -U_DEBUG -DNDEBUG  -DMODULE  -D"KBUILD_STR(s)=#s" -D"KBUILD_BASENAME=KBUILD_STR(nv_acpi)"  -D"KBUILD_MODNAME=KBUILD_STR(nvidia)" -c -o /tmp/akmodsbuild.ONiVGc0h/BUILD/nvidia-304xx-kmod-304.88/_kmod_build_3.10.3-300.fc19.i686.PAE/kernel/nv-acpi.o /tmp/akmodsbuild.ONiVGc0h/BUILD/nvidia-304xx-kmod-304.88/_kmod_build_3.10.3-300.fc19.i686.PAE/kernel/nv-acpi.c
27 juil. 12:30:53 akmodsbuild: In file included from /usr/src/kernels/3.10.3-300.fc19.i686.PAE/arch/x86/include/asm/bitops.h:514:0,
27 juil. 12:30:53 akmodsbuild: from include/linux/bitops.h:22,
27 juil. 12:30:53 akmodsbuild: from include/linux/kernel.h:10,
27 juil. 12:30:53 akmodsbuild: from include/linux/sched.h:15,
27 juil. 12:30:53 akmodsbuild: from include/linux/utsname.h:5,
27 juil. 12:30:53 akmodsbuild: from /tmp/akmodsbuild.ONiVGc0h/BUILD/nvidia-304xx-kmod-304.88/_kmod_build_3.10.3-300.fc19.i686.PAE/kernel/nv-linux.h:40,
27 juil. 12:30:53 akmodsbuild: from /tmp/akmodsbuild.ONiVGc0h/BUILD/nvidia-304xx-kmod-304.88/_kmod_build_3.10.3-300.fc19.i686.PAE/kernel/nv.c:13:
27 juil. 12:30:53 akmodsbuild: include/linux/bitops.h: In function 'hweight_long':
27 juil. 12:30:53 akmodsbuild: include/asm-generic/bitops/const_hweight.h:26:70: warning: signed and unsigned type in conditional expression [-Wsign-compare]
27 juil. 12:30:53 akmodsbuild: #define hweight32(w) (__builtin_constant_p(w) ? __const_hweight32(w) : __arch_hweight32(w))
27 juil. 12:30:53 akmodsbuild: ^
27 juil. 12:30:53 akmodsbuild: include/linux/bitops.h:66:26: note: in expansion of macro 'hweight32'
27 juil. 12:30:53 akmodsbuild: return sizeof(w) == 4 ? hweight32(w) : hweight64(w);
27 juil. 12:30:53 akmodsbuild: ^
27 juil. 12:30:53 akmodsbuild: In file included from /usr/src/kernels/3.10.3-300.fc19.i686.PAE/arch/x86/include/asm/bitops.h:514:0,
27 juil. 12:30:53 akmodsbuild: from include/linux/bitops.h:22,
27 juil. 12:30:53 akmodsbuild: from include/linux/kernel.h:10,
27 juil. 12:30:53 akmodsbuild: from include/linux/sched.h:15,
27 juil. 12:30:53 akmodsbuild: from include/linux/utsname.h:5,
27 juil. 12:30:53 akmodsbuild: from /tmp/akmodsbuild.ONiVGc0h/BUILD/nvidia-304xx-kmod-304.88/_kmod_build_3.10.3-300.fc19.i686.PAE/kernel/nv-linux.h:40,
27 juil. 12:30:53 akmodsbuild: from /tmp/akmodsbuild.ONiVGc0h/BUILD/nvidia-304xx-kmod-304.88/_kmod_build_3.10.3-300.fc19.i686.PAE/kernel/nv-acpi.c:15:
27 juil. 12:30:53 akmodsbuild: include/linux/bitops.h: In function 'hweight_long':
27 juil. 12:30:53 akmodsbuild: include/asm-generic/bitops/const_hweight.h:26:70: warning: signed and unsigned type in conditional expression [-Wsign-compare]
27 juil. 12:30:53 akmodsbuild: #define hweight32(w) (__builtin_constant_p(w) ? __const_hweight32(w) : __arch_hweight32(w))
27 juil. 12:30:53 akmodsbuild: ^
27 juil. 12:30:53 akmodsbuild: include/linux/bitops.h:66:26: note: in expansion of macro 'hweight32'
27 juil. 12:30:53 akmodsbuild: return sizeof(w) == 4 ? hweight32(w) : hweight64(w);
27 juil. 12:30:53 akmodsbuild: ^
27 juil. 12:30:53 akmodsbuild: In file included from /usr/src/kernels/3.10.3-300.fc19.i686.PAE/arch/x86/include/asm/cpumask.h:4:0,
27 juil. 12:30:53 akmodsbuild: from /usr/src/kernels/3.10.3-300.fc19.i686.PAE/arch/x86/include/asm/msr.h:10,
27 juil. 12:30:53 akmodsbuild: from /usr/src/kernels/3.10.3-300.fc19.i686.PAE/arch/x86/include/asm/processor.h:20,
27 juil. 12:30:53 akmodsbuild: from /usr/src/kernels/3.10.3-300.fc19.i686.PAE/arch/x86/include/asm/thread_info.h:22,
27 juil. 12:30:53 akmodsbuild: from include/linux/thread_info.h:54,
27 juil. 12:30:53 akmodsbuild: from include/linux/preempt.h:9,
27 juil. 12:30:53 akmodsbuild: from include/linux/spinlock.h:50,
27 juil. 12:30:53 akmodsbuild: from include/linux/seqlock.h:29,
27 juil. 12:30:53 akmodsbuild: from include/linux/time.h:5,
27 juil. 12:30:53 akmodsbuild: from include/uapi/linux/timex.h:56,
27 juil. 12:30:53 akmodsbuild: from include/linux/timex.h:56,
27 juil. 12:30:53 akmodsbuild: from include/linux/sched.h:17,
27 juil. 12:30:53 akmodsbuild: from include/linux/utsname.h:5,
27 juil. 12:30:53 akmodsbuild: from /tmp/akmodsbuild.ONiVGc0h/BUILD/nvidia-304xx-kmod-304.88/_kmod_build_3.10.3-300.fc19.i686.PAE/kernel/nv-linux.h:40,
27 juil. 12:30:53 akmodsbuild: from /tmp/akmodsbuild.ONiVGc0h/BUILD/nvidia-304xx-kmod-304.88/_kmod_build_3.10.3-300.fc19.i686.PAE/kernel/nv.c:13:
27 juil. 12:30:53 akmodsbuild: include/linux/cpumask.h: In function 'cpumask_parse':
27 juil. 12:30:53 akmodsbuild: include/linux/cpumask.h:603:26: warning: signed and unsigned type in conditional expression [-Wsign-compare]
27 juil. 12:30:53 akmodsbuild: int len = nl ? nl - buf : strlen(buf);
27 juil. 12:30:53 akmodsbuild: ^
27 juil. 12:30:53 akmodsbuild: In file included from /usr/src/kernels/3.10.3-300.fc19.i686.PAE/arch/x86/include/asm/cpumask.h:4:0,
27 juil. 12:30:53 akmodsbuild: from /usr/src/kernels/3.10.3-300.fc19.i686.PAE/arch/x86/include/asm/msr.h:10,
27 juil. 12:30:53 akmodsbuild: from /usr/src/kernels/3.10.3-300.fc19.i686.PAE/arch/x86/include/asm/processor.h:20,
27 juil. 12:30:53 akmodsbuild: from /usr/src/kernels/3.10.3-300.fc19.i686.PAE/arch/x86/include/asm/thread_info.h:22,
27 juil. 12:30:53 akmodsbuild: from include/linux/thread_info.h:54,
27 juil. 12:30:53 akmodsbuild: from include/linux/preempt.h:9,
27 juil. 12:30:53 akmodsbuild: from include/linux/spinlock.h:50,
27 juil. 12:30:53 akmodsbuild: from include/linux/seqlock.h:29,
27 juil. 12:30:53 akmodsbuild: from include/linux/time.h:5,
27 juil. 12:30:53 akmodsbuild: from include/uapi/linux/timex.h:56,
27 juil. 12:30:53 akmodsbuild: from include/linux/timex.h:56,
27 juil. 12:30:53 akmodsbuild: from include/linux/sched.h:17,
27 juil. 12:30:53 akmodsbuild: from include/linux/utsname.h:5,
27 juil. 12:30:53 akmodsbuild: from /tmp/akmodsbuild.ONiVGc0h/BUILD/nvidia-304xx-kmod-304.88/_kmod_build_3.10.3-300.fc19.i686.PAE/kernel/nv-linux.h:40,
27 juil. 12:30:53 akmodsbuild: from /tmp/akmodsbuild.ONiVGc0h/BUILD/nvidia-304xx-kmod-304.88/_kmod_build_3.10.3-300.fc19.i686.PAE/kernel/nv-acpi.c:15:
27 juil. 12:30:53 akmodsbuild: include/linux/cpumask.h: In function 'cpumask_parse':
27 juil. 12:30:53 akmodsbuild: include/linux/cpumask.h:603:26: warning: signed and unsigned type in conditional expression [-Wsign-compare]
27 juil. 12:30:53 akmodsbuild: int len = nl ? nl - buf : strlen(buf);
27 juil. 12:30:53 akmodsbuild: ^
27 juil. 12:30:53 akmodsbuild: In file included from include/uapi/linux/stddef.h:1:0,
27 juil. 12:30:53 akmodsbuild: from include/linux/stddef.h:4,
27 juil. 12:30:53 akmodsbuild: from /usr/src/kernels/3.10.3-300.fc19.i686.PAE/include/uapi/linux/posix_types.h:4,
27 juil. 12:30:53 akmodsbuild: from include/uapi/linux/types.h:13,
27 juil. 12:30:53 akmodsbuild: from include/linux/types.h:5,
27 juil. 12:30:53 akmodsbuild: from include/uapi/linux/capability.h:16,
27 juil. 12:30:53 akmodsbuild: from include/linux/capability.h:15,
27 juil. 12:30:53 akmodsbuild: from include/linux/sched.h:13,
27 juil. 12:30:53 akmodsbuild: from include/linux/utsname.h:5,
27 juil. 12:30:53 akmodsbuild: from /tmp/akmodsbuild.ONiVGc0h/BUILD/nvidia-304xx-kmod-304.88/_kmod_build_3.10.3-300.fc19.i686.PAE/kernel/nv-linux.h:40,
27 juil. 12:30:53 akmodsbuild: from /tmp/akmodsbuild.ONiVGc0h/BUILD/nvidia-304xx-kmod-304.88/_kmod_build_3.10.3-300.fc19.i686.PAE/kernel/nv.c:13:
27 juil. 12:30:53 akmodsbuild: /usr/src/kernels/3.10.3-300.fc19.i686.PAE/arch/x86/include/asm/uaccess_32.h: In function 'copy_from_user':
27 juil. 12:30:53 akmodsbuild: /usr/src/kernels/3.10.3-300.fc19.i686.PAE/arch/x86/include/asm/uaccess_32.h:208:28: warning: comparison between signed and unsigned integer expressions [-Wsign-compare]
27 juil. 12:30:53 akmodsbuild: if (likely(sz == -1 || sz >= n))
27 juil. 12:30:53 akmodsbuild: ^
27 juil. 12:30:53 akmodsbuild: include/linux/compiler.h:152:40: note: in definition of macro 'likely'
27 juil. 12:30:53 akmodsbuild: # define likely(x) __builtin_expect(!!(x), 1)
27 juil. 12:30:53 akmodsbuild: ^
27 juil. 12:30:53 akmodsbuild: In file included from include/uapi/linux/stddef.h:1:0,
27 juil. 12:30:53 akmodsbuild: from include/linux/stddef.h:4,
27 juil. 12:30:53 akmodsbuild: from /usr/src/kernels/3.10.3-300.fc19.i686.PAE/include/uapi/linux/posix_types.h:4,
27 juil. 12:30:53 akmodsbuild: from include/uapi/linux/types.h:13,
27 juil. 12:30:53 akmodsbuild: from include/linux/types.h:5,
27 juil. 12:30:53 akmodsbuild: from include/uapi/linux/capability.h:16,
27 juil. 12:30:53 akmodsbuild: from include/linux/capability.h:15,
27 juil. 12:30:53 akmodsbuild: from include/linux/sched.h:13,
27 juil. 12:30:53 akmodsbuild: from include/linux/utsname.h:5,
27 juil. 12:30:53 akmodsbuild: from /tmp/akmodsbuild.ONiVGc0h/BUILD/nvidia-304xx-kmod-304.88/_kmod_build_3.10.3-300.fc19.i686.PAE/kernel/nv-linux.h:40,
27 juil. 12:30:53 akmodsbuild: from /tmp/akmodsbuild.ONiVGc0h/BUILD/nvidia-304xx-kmod-304.88/_kmod_build_3.10.3-300.fc19.i686.PAE/kernel/nv-acpi.c:15:
27 juil. 12:30:53 akmodsbuild: /usr/src/kernels/3.10.3-300.fc19.i686.PAE/arch/x86/include/asm/uaccess_32.h: In function 'copy_from_user':
27 juil. 12:30:53 akmodsbuild: /usr/src/kernels/3.10.3-300.fc19.i686.PAE/arch/x86/include/asm/uaccess_32.h:208:28: warning: comparison between signed and unsigned integer expressions [-Wsign-compare]
27 juil. 12:30:53 akmodsbuild: if (likely(sz == -1 || sz >= n))
27 juil. 12:30:53 akmodsbuild: ^
27 juil. 12:30:53 akmodsbuild: include/linux/compiler.h:152:40: note: in definition of macro 'likely'
27 juil. 12:30:53 akmodsbuild: # define likely(x) __builtin_expect(!!(x), 1)
27 juil. 12:30:53 akmodsbuild: ^
27 juil. 12:30:53 akmodsbuild: /tmp/akmodsbuild.ONiVGc0h/BUILD/nvidia-304xx-kmod-304.88/_kmod_build_3.10.3-300.fc19.i686.PAE/kernel/nv-acpi.c: At top level:
27 juil. 12:30:53 akmodsbuild: /tmp/akmodsbuild.ONiVGc0h/BUILD/nvidia-304xx-kmod-304.88/_kmod_build_3.10.3-300.fc19.i686.PAE/kernel/nv-acpi.c:66:9: warning: initialization from incompatible pointer type [enabled by default]
27 juil. 12:30:53 akmodsbuild: .remove = nv_acpi_remove,
27 juil. 12:30:53 akmodsbuild: ^
27 juil. 12:30:53 akmodsbuild: /tmp/akmodsbuild.ONiVGc0h/BUILD/nvidia-304xx-kmod-304.88/_kmod_build_3.10.3-300.fc19.i686.PAE/kernel/nv-acpi.c:66:9: warning: (near initialization for 'nv_acpi_driver_template.ops.remove') [enabled by default]
27 juil. 12:30:53 akmodsbuild: if [ "-pg" = "-pg" ]; then if [ /tmp/akmodsbuild.ONiVGc0h/BUILD/nvidia-304xx-kmod-304.88/_kmod_build_3.10.3-300.fc19.i686.PAE/kernel/nv-acpi.o != "scripts/mod/empty.o" ]; then /usr/src/kernels/3.10.3-300.fc19.i686.PAE/scripts/recordmcount  "/tmp/akmodsbuild.ONiVGc0h/BUILD/nvidia-304xx-kmod-304.88/_kmod_build_3.10.3-300.fc19.i686.PAE/kernel/nv-acpi.o"; fi; fi;
27 juil. 12:30:53 akmodsbuild: cc -Wp,-MD,/tmp/akmodsbuild.ONiVGc0h/BUILD/nvidia-304xx-kmod-304.88/_kmod_build_3.10.3-300.fc19.i686.PAE/kernel/.nv-chrdev.o.d  -nostdinc -isystem /usr/lib/gcc/i686-redhat-linux/4.8.1/include -I/usr/src/kernels/3.10.3-300.fc19.i686.PAE/arch/x86/include -Iarch/x86/include/generated  -Iinclude -I/usr/src/kernels/3.10.3-300.fc19.i686.PAE/arch/x86/include/uapi -Iarch/x86/include/generated/uapi -I/usr/src/kernels/3.10.3-300.fc19.i686.PAE/include/uapi -Iinclude/generated/uapi -include /usr/src/kernels/3.10.3-300.fc19.i686.PAE/include/linux/kconfig.h -D__KERNEL__ -Wall -Wundef -Wstrict-prototypes -Wno-trigraphs -fno-strict-aliasing -fno-common -Werror-implicit-function-declaration -Wno-format-security -fno-delete-null-pointer-checks -O2 -m32 -msoft-float -mregparm=3 -freg-struct-return -fno-pic -mpreferred-stack-boundary=2 -march=i686 -mtune=generic -maccumulate-outgoing-args -Wa,-mtune=generic32 -ffreestanding -fstack-protector -DCONFIG_AS_CFI=1 -DCONFIG_AS_CFI_SIGNAL_FRAME=1 -DCONFIG_AS_CFI_SECTIONS=1 -DCONFIG_AS_AVX=1 -DCONFIG_AS_AVX2=1 -pipe -Wno-sign-compare -fno-asynchronous-unwind-tables -mno-sse -mno-mmx -mno-sse2 -mno-3dnow -mno-avx -Wframe-larger-than=1024 -Wno-unused-but-set-variable -fno-omit-frame-pointer -fno-optimize-sibling-calls -g -pg -Wdeclaration-after-statement -Wno-pointer-sign -fno-strict-overflow -fconserve-stack -DCC_HAVE_ASM_GOTO -I/tmp/akmodsbuild.ONiVGc0h/BUILD/nvidia-304xx-kmod-304.88/_kmod_build_3.10.3-300.fc19.i686.PAE/kernel -Wall -MD -Wsign-compare -Wno-cast-qual -Wno-error -D__KERNEL__ -DMODULE -DNVRM -DNV_VERSION_STRING="304.88" -Wno-unused-function -Wuninitialized -UDEBUG -U_DEBUG -DNDEBUG  -DMODULE  -D"KBUILD_STR(s)=#s" -D"KBUILD_BASENAME=KBUILD_STR(nv_chrdev)"  -D"KBUILD_MODNAME=KBUILD_STR(nvidia)" -c -o /tmp/akmodsbuild.ONiVGc0h/BUILD/nvidia-304xx-kmod-304.88/_kmod_build_3.10.3-300.fc19.i686.PAE/kernel/nv-chrdev.o /tmp/akmodsbuild.ONiVGc0h/BUILD/nvidia-304xx-kmod-304.88/_kmod_build_3.10.3-300.fc19.i686.PAE/kernel/nv-chrdev.c
27 juil. 12:30:53 akmodsbuild: In file included from /usr/src/kernels/3.10.3-300.fc19.i686.PAE/arch/x86/include/asm/bitops.h:514:0,
27 juil. 12:30:53 akmodsbuild: from include/linux/bitops.h:22,
27 juil. 12:30:53 akmodsbuild: from include/linux/kernel.h:10,
27 juil. 12:30:53 akmodsbuild: from include/linux/sched.h:15,
27 juil. 12:30:53 akmodsbuild: from include/linux/utsname.h:5,
27 juil. 12:30:53 akmodsbuild: from /tmp/akmodsbuild.ONiVGc0h/BUILD/nvidia-304xx-kmod-304.88/_kmod_build_3.10.3-300.fc19.i686.PAE/kernel/nv-linux.h:40,
27 juil. 12:30:53 akmodsbuild: from /tmp/akmodsbuild.ONiVGc0h/BUILD/nvidia-304xx-kmod-304.88/_kmod_build_3.10.3-300.fc19.i686.PAE/kernel/nv-chrdev.c:15:
27 juil. 12:30:53 akmodsbuild: include/linux/bitops.h: In function 'hweight_long':
27 juil. 12:30:53 akmodsbuild: include/asm-generic/bitops/const_hweight.h:26:70: warning: signed and unsigned type in conditional expression [-Wsign-compare]
27 juil. 12:30:53 akmodsbuild: #define hweight32(w) (__builtin_constant_p(w) ? __const_hweight32(w) : __arch_hweight32(w))
27 juil. 12:30:53 akmodsbuild: ^
27 juil. 12:30:53 akmodsbuild: include/linux/bitops.h:66:26: note: in expansion of macro 'hweight32'
27 juil. 12:30:53 akmodsbuild: return sizeof(w) == 4 ? hweight32(w) : hweight64(w);
27 juil. 12:30:53 akmodsbuild: ^
27 juil. 12:30:53 akmodsbuild: In file included from /usr/src/kernels/3.10.3-300.fc19.i686.PAE/arch/x86/include/asm/cpumask.h:4:0,
27 juil. 12:30:53 akmodsbuild: from /usr/src/kernels/3.10.3-300.fc19.i686.PAE/arch/x86/include/asm/msr.h:10,
27 juil. 12:30:53 akmodsbuild: from /usr/src/kernels/3.10.3-300.fc19.i686.PAE/arch/x86/include/asm/processor.h:20,
27 juil. 12:30:53 akmodsbuild: from /usr/src/kernels/3.10.3-300.fc19.i686.PAE/arch/x86/include/asm/thread_info.h:22,
27 juil. 12:30:53 akmodsbuild: from include/linux/thread_info.h:54,
27 juil. 12:30:53 akmodsbuild: from include/linux/preempt.h:9,
27 juil. 12:30:53 akmodsbuild: from include/linux/spinlock.h:50,
27 juil. 12:30:53 akmodsbuild: from include/linux/seqlock.h:29,
27 juil. 12:30:53 akmodsbuild: from include/linux/time.h:5,
27 juil. 12:30:53 akmodsbuild: from include/uapi/linux/timex.h:56,
27 juil. 12:30:53 akmodsbuild: from include/linux/timex.h:56,
27 juil. 12:30:53 akmodsbuild: from include/linux/sched.h:17,
27 juil. 12:30:53 akmodsbuild: from include/linux/utsname.h:5,
27 juil. 12:30:53 akmodsbuild: from /tmp/akmodsbuild.ONiVGc0h/BUILD/nvidia-304xx-kmod-304.88/_kmod_build_3.10.3-300.fc19.i686.PAE/kernel/nv-linux.h:40,
27 juil. 12:30:53 akmodsbuild: from /tmp/akmodsbuild.ONiVGc0h/BUILD/nvidia-304xx-kmod-304.88/_kmod_build_3.10.3-300.fc19.i686.PAE/kernel/nv-chrdev.c:15:
27 juil. 12:30:53 akmodsbuild: include/linux/cpumask.h: In function 'cpumask_parse':
27 juil. 12:30:53 akmodsbuild: include/linux/cpumask.h:603:26: warning: signed and unsigned type in conditional expression [-Wsign-compare]
27 juil. 12:30:53 akmodsbuild: int len = nl ? nl - buf : strlen(buf);
27 juil. 12:30:53 akmodsbuild: ^
27 juil. 12:30:53 akmodsbuild: In file included from include/uapi/linux/stddef.h:1:0,
27 juil. 12:30:53 akmodsbuild: from include/linux/stddef.h:4,
27 juil. 12:30:53 akmodsbuild: from /usr/src/kernels/3.10.3-300.fc19.i686.PAE/include/uapi/linux/posix_types.h:4,
27 juil. 12:30:53 akmodsbuild: from include/uapi/linux/types.h:13,
27 juil. 12:30:53 akmodsbuild: from include/linux/types.h:5,
27 juil. 12:30:53 akmodsbuild: from include/uapi/linux/capability.h:16,
27 juil. 12:30:53 akmodsbuild: from include/linux/capability.h:15,
27 juil. 12:30:53 akmodsbuild: from include/linux/sched.h:13,
27 juil. 12:30:53 akmodsbuild: from include/linux/utsname.h:5,
27 juil. 12:30:53 akmodsbuild: from /tmp/akmodsbuild.ONiVGc0h/BUILD/nvidia-304xx-kmod-304.88/_kmod_build_3.10.3-300.fc19.i686.PAE/kernel/nv-linux.h:40,
27 juil. 12:30:53 akmodsbuild: from /tmp/akmodsbuild.ONiVGc0h/BUILD/nvidia-304xx-kmod-304.88/_kmod_build_3.10.3-300.fc19.i686.PAE/kernel/nv-chrdev.c:15:
27 juil. 12:30:53 akmodsbuild: /usr/src/kernels/3.10.3-300.fc19.i686.PAE/arch/x86/include/asm/uaccess_32.h: In function 'copy_from_user':
27 juil. 12:30:53 akmodsbuild: /usr/src/kernels/3.10.3-300.fc19.i686.PAE/arch/x86/include/asm/uaccess_32.h:208:28: warning: comparison between signed and unsigned integer expressions [-Wsign-compare]
27 juil. 12:30:53 akmodsbuild: if (likely(sz == -1 || sz >= n))
27 juil. 12:30:53 akmodsbuild: ^
27 juil. 12:30:53 akmodsbuild: include/linux/compiler.h:152:40: note: in definition of macro 'likely'
27 juil. 12:30:53 akmodsbuild: # define likely(x) __builtin_expect(!!(x), 1)
27 juil. 12:30:53 akmodsbuild: ^
27 juil. 12:30:53 akmodsbuild: if [ "-pg" = "-pg" ]; then if [ /tmp/akmodsbuild.ONiVGc0h/BUILD/nvidia-304xx-kmod-304.88/_kmod_build_3.10.3-300.fc19.i686.PAE/kernel/nv-chrdev.o != "scripts/mod/empty.o" ]; then /usr/src/kernels/3.10.3-300.fc19.i686.PAE/scripts/recordmcount  "/tmp/akmodsbuild.ONiVGc0h/BUILD/nvidia-304xx-kmod-304.88/_kmod_build_3.10.3-300.fc19.i686.PAE/kernel/nv-chrdev.o"; fi; fi;
27 juil. 12:30:53 akmodsbuild: cc -Wp,-MD,/tmp/akmodsbuild.ONiVGc0h/BUILD/nvidia-304xx-kmod-304.88/_kmod_build_3.10.3-300.fc19.i686.PAE/kernel/.nv-cray.o.d  -nostdinc -isystem /usr/lib/gcc/i686-redhat-linux/4.8.1/include -I/usr/src/kernels/3.10.3-300.fc19.i686.PAE/arch/x86/include -Iarch/x86/include/generated  -Iinclude -I/usr/src/kernels/3.10.3-300.fc19.i686.PAE/arch/x86/include/uapi -Iarch/x86/include/generated/uapi -I/usr/src/kernels/3.10.3-300.fc19.i686.PAE/include/uapi -Iinclude/generated/uapi -include /usr/src/kernels/3.10.3-300.fc19.i686.PAE/include/linux/kconfig.h -D__KERNEL__ -Wall -Wundef -Wstrict-prototypes -Wno-trigraphs -fno-strict-aliasing -fno-common -Werror-implicit-function-declaration -Wno-format-security -fno-delete-null-pointer-checks -O2 -m32 -msoft-float -mregparm=3 -freg-struct-return -fno-pic -mpreferred-stack-boundary=2 -march=i686 -mtune=generic -maccumulate-outgoing-args -Wa,-mtune=generic32 -ffreestanding -fstack-protector -DCONFIG_AS_CFI=1 -DCONFIG_AS_CFI_SIGNAL_FRAME=1 -DCONFIG_AS_CFI_SECTIONS=1 -DCONFIG_AS_AVX=1 -DCONFIG_AS_AVX2=1 -pipe -Wno-sign-compare -fno-asynchronous-unwind-tables -mno-sse -mno-mmx -mno-sse2 -mno-3dnow -mno-avx -Wframe-larger-than=1024 -Wno-unused-but-set-variable -fno-omit-frame-pointer -fno-optimize-sibling-calls -g -pg -Wdeclaration-after-statement -Wno-pointer-sign -fno-strict-overflow -fconserve-stack -DCC_HAVE_ASM_GOTO -I/tmp/akmodsbuild.ONiVGc0h/BUILD/nvidia-304xx-kmod-304.88/_kmod_build_3.10.3-300.fc19.i686.PAE/kernel -Wall -MD -Wsign-compare -Wno-cast-qual -Wno-error -D__KERNEL__ -DMODULE -DNVRM -DNV_VERSION_STRING="304.88" -Wno-unused-function -Wuninitialized -UDEBUG -U_DEBUG -DNDEBUG  -DMODULE  -D"KBUILD_STR(s)=#s" -D"KBUILD_BASENAME=KBUILD_STR(nv_cray)"  -D"KBUILD_MODNAME=KBUILD_STR(nvidia)" -c -o /tmp/akmodsbuild.ONiVGc0h/BUILD/nvidia-304xx-kmod-304.88/_kmod_build_3.10.3-300.fc19.i686.PAE/kernel/nv-cray.o /tmp/akmodsbuild.ONiVGc0h/BUILD/nvidia-304xx-kmod-304.88/_kmod_build_3.10.3-300.fc19.i686.PAE/kernel/nv-cray.c
27 juil. 12:30:53 akmodsbuild: In file included from /usr/src/kernels/3.10.3-300.fc19.i686.PAE/arch/x86/include/asm/bitops.h:514:0,
27 juil. 12:30:53 akmodsbuild: from include/linux/bitops.h:22,
27 juil. 12:30:53 akmodsbuild: from include/linux/kernel.h:10,
27 juil. 12:30:53 akmodsbuild: from include/linux/sched.h:15,
27 juil. 12:30:53 akmodsbuild: from include/linux/utsname.h:5,
27 juil. 12:30:53 akmodsbuild: from /tmp/akmodsbuild.ONiVGc0h/BUILD/nvidia-304xx-kmod-304.88/_kmod_build_3.10.3-300.fc19.i686.PAE/kernel/nv-linux.h:40,
27 juil. 12:30:53 akmodsbuild: from /tmp/akmodsbuild.ONiVGc0h/BUILD/nvidia-304xx-kmod-304.88/_kmod_build_3.10.3-300.fc19.i686.PAE/kernel/nv-cray.c:15:
27 juil. 12:30:53 akmodsbuild: include/linux/bitops.h: In function 'hweight_long':
27 juil. 12:30:53 akmodsbuild: include/asm-generic/bitops/const_hweight.h:26:70: warning: signed and unsigned type in conditional expression [-Wsign-compare]
27 juil. 12:30:53 akmodsbuild: #define hweight32(w) (__builtin_constant_p(w) ? __const_hweight32(w) : __arch_hweight32(w))
27 juil. 12:30:53 akmodsbuild: ^
27 juil. 12:30:53 akmodsbuild: include/linux/bitops.h:66:26: note: in expansion of macro 'hweight32'
27 juil. 12:30:53 akmodsbuild: return sizeof(w) == 4 ? hweight32(w) : hweight64(w);
27 juil. 12:30:53 akmodsbuild: ^
27 juil. 12:30:53 akmodsbuild: In file included from /usr/src/kernels/3.10.3-300.fc19.i686.PAE/arch/x86/include/asm/cpumask.h:4:0,
27 juil. 12:30:53 akmodsbuild: from /usr/src/kernels/3.10.3-300.fc19.i686.PAE/arch/x86/include/asm/msr.h:10,
27 juil. 12:30:53 akmodsbuild: from /usr/src/kernels/3.10.3-300.fc19.i686.PAE/arch/x86/include/asm/processor.h:20,
27 juil. 12:30:53 akmodsbuild: from /usr/src/kernels/3.10.3-300.fc19.i686.PAE/arch/x86/include/asm/thread_info.h:22,
27 juil. 12:30:53 akmodsbuild: from include/linux/thread_info.h:54,
27 juil. 12:30:53 akmodsbuild: from include/linux/preempt.h:9,
27 juil. 12:30:53 akmodsbuild: from include/linux/spinlock.h:50,
27 juil. 12:30:53 akmodsbuild: from include/linux/seqlock.h:29,
27 juil. 12:30:53 akmodsbuild: from include/linux/time.h:5,
27 juil. 12:30:53 akmodsbuild: from include/uapi/linux/timex.h:56,
27 juil. 12:30:53 akmodsbuild: from include/linux/timex.h:56,
27 juil. 12:30:53 akmodsbuild: from include/linux/sched.h:17,
27 juil. 12:30:53 akmodsbuild: from include/linux/utsname.h:5,
27 juil. 12:30:53 akmodsbuild: from /tmp/akmodsbuild.ONiVGc0h/BUILD/nvidia-304xx-kmod-304.88/_kmod_build_3.10.3-300.fc19.i686.PAE/kernel/nv-linux.h:40,
27 juil. 12:30:53 akmodsbuild: from /tmp/akmodsbuild.ONiVGc0h/BUILD/nvidia-304xx-kmod-304.88/_kmod_build_3.10.3-300.fc19.i686.PAE/kernel/nv-cray.c:15:
27 juil. 12:30:53 akmodsbuild: include/linux/cpumask.h: In function 'cpumask_parse':
27 juil. 12:30:53 akmodsbuild: include/linux/cpumask.h:603:26: warning: signed and unsigned type in conditional expression [-Wsign-compare]
27 juil. 12:30:53 akmodsbuild: int len = nl ? nl - buf : strlen(buf);
27 juil. 12:30:53 akmodsbuild: ^
27 juil. 12:30:53 akmodsbuild: In file included from include/uapi/linux/stddef.h:1:0,
27 juil. 12:30:53 akmodsbuild: from include/linux/stddef.h:4,
27 juil. 12:30:53 akmodsbuild: from /usr/src/kernels/3.10.3-300.fc19.i686.PAE/include/uapi/linux/posix_types.h:4,
27 juil. 12:30:53 akmodsbuild: from include/uapi/linux/types.h:13,
27 juil. 12:30:53 akmodsbuild: from include/linux/types.h:5,
27 juil. 12:30:53 akmodsbuild: from include/uapi/linux/capability.h:16,
27 juil. 12:30:53 akmodsbuild: from include/linux/capability.h:15,
27 juil. 12:30:53 akmodsbuild: from include/linux/sched.h:13,
27 juil. 12:30:53 akmodsbuild: from include/linux/utsname.h:5,
27 juil. 12:30:53 akmodsbuild: from /tmp/akmodsbuild.ONiVGc0h/BUILD/nvidia-304xx-kmod-304.88/_kmod_build_3.10.3-300.fc19.i686.PAE/kernel/nv-linux.h:40,
27 juil. 12:30:53 akmodsbuild: from /tmp/akmodsbuild.ONiVGc0h/BUILD/nvidia-304xx-kmod-304.88/_kmod_build_3.10.3-300.fc19.i686.PAE/kernel/nv-cray.c:15:
27 juil. 12:30:53 akmodsbuild: /usr/src/kernels/3.10.3-300.fc19.i686.PAE/arch/x86/include/asm/uaccess_32.h: In function 'copy_from_user':
27 juil. 12:30:53 akmodsbuild: /usr/src/kernels/3.10.3-300.fc19.i686.PAE/arch/x86/include/asm/uaccess_32.h:208:28: warning: comparison between signed and unsigned integer expressions [-Wsign-compare]
27 juil. 12:30:53 akmodsbuild: if (likely(sz == -1 || sz >= n))
27 juil. 12:30:53 akmodsbuild: ^
27 juil. 12:30:53 akmodsbuild: include/linux/compiler.h:152:40: note: in definition of macro 'likely'
27 juil. 12:30:53 akmodsbuild: # define likely(x) __builtin_expect(!!(x), 1)
27 juil. 12:30:53 akmodsbuild: ^
27 juil. 12:30:53 akmodsbuild: if [ "-pg" = "-pg" ]; then if [ /tmp/akmodsbuild.ONiVGc0h/BUILD/nvidia-304xx-kmod-304.88/_kmod_build_3.10.3-300.fc19.i686.PAE/kernel/nv.o != "scripts/mod/empty.o" ]; then /usr/src/kernels/3.10.3-300.fc19.i686.PAE/scripts/recordmcount  "/tmp/akmodsbuild.ONiVGc0h/BUILD/nvidia-304xx-kmod-304.88/_kmod_build_3.10.3-300.fc19.i686.PAE/kernel/nv.o"; fi; fi;
27 juil. 12:30:53 akmodsbuild: cc -Wp,-MD,/tmp/akmodsbuild.ONiVGc0h/BUILD/nvidia-304xx-kmod-304.88/_kmod_build_3.10.3-300.fc19.i686.PAE/kernel/.nv-gvi.o.d  -nostdinc -isystem /usr/lib/gcc/i686-redhat-linux/4.8.1/include -I/usr/src/kernels/3.10.3-300.fc19.i686.PAE/arch/x86/include -Iarch/x86/include/generated  -Iinclude -I/usr/src/kernels/3.10.3-300.fc19.i686.PAE/arch/x86/include/uapi -Iarch/x86/include/generated/uapi -I/usr/src/kernels/3.10.3-300.fc19.i686.PAE/include/uapi -Iinclude/generated/uapi -include /usr/src/kernels/3.10.3-300.fc19.i686.PAE/include/linux/kconfig.h -D__KERNEL__ -Wall -Wundef -Wstrict-prototypes -Wno-trigraphs -fno-strict-aliasing -fno-common -Werror-implicit-function-declaration -Wno-format-security -fno-delete-null-pointer-checks -O2 -m32 -msoft-float -mregparm=3 -freg-struct-return -fno-pic -mpreferred-stack-boundary=2 -march=i686 -mtune=generic -maccumulate-outgoing-args -Wa,-mtune=generic32 -ffreestanding -fstack-protector -DCONFIG_AS_CFI=1 -DCONFIG_AS_CFI_SIGNAL_FRAME=1 -DCONFIG_AS_CFI_SECTIONS=1 -DCONFIG_AS_AVX=1 -DCONFIG_AS_AVX2=1 -pipe -Wno-sign-compare -fno-asynchronous-unwind-tables -mno-sse -mno-mmx -mno-sse2 -mno-3dnow -mno-avx -Wframe-larger-than=1024 -Wno-unused-but-set-variable -fno-omit-frame-pointer -fno-optimize-sibling-calls -g -pg -Wdeclaration-after-statement -Wno-pointer-sign -fno-strict-overflow -fconserve-stack -DCC_HAVE_ASM_GOTO -I/tmp/akmodsbuild.ONiVGc0h/BUILD/nvidia-304xx-kmod-304.88/_kmod_build_3.10.3-300.fc19.i686.PAE/kernel -Wall -MD -Wsign-compare -Wno-cast-qual -Wno-error -D__KERNEL__ -DMODULE -DNVRM -DNV_VERSION_STRING="304.88" -Wno-unused-function -Wuninitialized -UDEBUG -U_DEBUG -DNDEBUG  -DMODULE  -D"KBUILD_STR(s)=#s" -D"KBUILD_BASENAME=KBUILD_STR(nv_gvi)"  -D"KBUILD_MODNAME=KBUILD_STR(nvidia)" -c -o /tmp/akmodsbuild.ONiVGc0h/BUILD/nvidia-304xx-kmod-304.88/_kmod_build_3.10.3-300.fc19.i686.PAE/kernel/nv-gvi.o /tmp/akmodsbuild.ONiVGc0h/BUILD/nvidia-304xx-kmod-304.88/_kmod_build_3.10.3-300.fc19.i686.PAE/kernel/nv-gvi.c
27 juil. 12:30:53 akmodsbuild: In file included from /usr/src/kernels/3.10.3-300.fc19.i686.PAE/arch/x86/include/asm/bitops.h:514:0,
27 juil. 12:30:53 akmodsbuild: from include/linux/bitops.h:22,
27 juil. 12:30:53 akmodsbuild: from include/linux/kernel.h:10,
27 juil. 12:30:53 akmodsbuild: from include/linux/sched.h:15,
27 juil. 12:30:53 akmodsbuild: from include/linux/utsname.h:5,
27 juil. 12:30:53 akmodsbuild: from /tmp/akmodsbuild.ONiVGc0h/BUILD/nvidia-304xx-kmod-304.88/_kmod_build_3.10.3-300.fc19.i686.PAE/kernel/nv-linux.h:40,
27 juil. 12:30:53 akmodsbuild: from /tmp/akmodsbuild.ONiVGc0h/BUILD/nvidia-304xx-kmod-304.88/_kmod_build_3.10.3-300.fc19.i686.PAE/kernel/nv-gvi.c:15:
27 juil. 12:30:53 akmodsbuild: include/linux/bitops.h: In function 'hweight_long':
27 juil. 12:30:53 akmodsbuild: include/asm-generic/bitops/const_hweight.h:26:70: warning: signed and unsigned type in conditional expression [-Wsign-compare]
27 juil. 12:30:53 akmodsbuild: #define hweight32(w) (__builtin_constant_p(w) ? __const_hweight32(w) : __arch_hweight32(w))
27 juil. 12:30:53 akmodsbuild: ^
27 juil. 12:30:53 akmodsbuild: include/linux/bitops.h:66:26: note: in expansion of macro 'hweight32'
27 juil. 12:30:53 akmodsbuild: return sizeof(w) == 4 ? hweight32(w) : hweight64(w);
27 juil. 12:30:53 akmodsbuild: ^
27 juil. 12:30:53 akmodsbuild: if [ "-pg" = "-pg" ]; then if [ /tmp/akmodsbuild.ONiVGc0h/BUILD/nvidia-304xx-kmod-304.88/_kmod_build_3.10.3-300.fc19.i686.PAE/kernel/nv-cray.o != "scripts/mod/empty.o" ]; then /usr/src/kernels/3.10.3-300.fc19.i686.PAE/scripts/recordmcount  "/tmp/akmodsbuild.ONiVGc0h/BUILD/nvidia-304xx-kmod-304.88/_kmod_build_3.10.3-300.fc19.i686.PAE/kernel/nv-cray.o"; fi; fi;
27 juil. 12:30:53 akmodsbuild: In file included from /usr/src/kernels/3.10.3-300.fc19.i686.PAE/arch/x86/include/asm/cpumask.h:4:0,
27 juil. 12:30:53 akmodsbuild: from /usr/src/kernels/3.10.3-300.fc19.i686.PAE/arch/x86/include/asm/msr.h:10,
27 juil. 12:30:53 akmodsbuild: from /usr/src/kernels/3.10.3-300.fc19.i686.PAE/arch/x86/include/asm/processor.h:20,
27 juil. 12:30:53 akmodsbuild: from /usr/src/kernels/3.10.3-300.fc19.i686.PAE/arch/x86/include/asm/thread_info.h:22,
27 juil. 12:30:53 akmodsbuild: from include/linux/thread_info.h:54,
27 juil. 12:30:53 akmodsbuild: from include/linux/preempt.h:9,
27 juil. 12:30:53 akmodsbuild: from include/linux/spinlock.h:50,
27 juil. 12:30:53 akmodsbuild: from include/linux/seqlock.h:29,
27 juil. 12:30:53 akmodsbuild: from include/linux/time.h:5,
27 juil. 12:30:53 akmodsbuild: from include/uapi/linux/timex.h:56,
27 juil. 12:30:53 akmodsbuild: from include/linux/timex.h:56,
27 juil. 12:30:53 akmodsbuild: from include/linux/sched.h:17,
27 juil. 12:30:53 akmodsbuild: from include/linux/utsname.h:5,
27 juil. 12:30:53 akmodsbuild: from /tmp/akmodsbuild.ONiVGc0h/BUILD/nvidia-304xx-kmod-304.88/_kmod_build_3.10.3-300.fc19.i686.PAE/kernel/nv-linux.h:40,
27 juil. 12:30:53 akmodsbuild: from /tmp/akmodsbuild.ONiVGc0h/BUILD/nvidia-304xx-kmod-304.88/_kmod_build_3.10.3-300.fc19.i686.PAE/kernel/nv-gvi.c:15:
27 juil. 12:30:53 akmodsbuild: include/linux/cpumask.h: In function 'cpumask_parse':
27 juil. 12:30:53 akmodsbuild: include/linux/cpumask.h:603:26: warning: signed and unsigned type in conditional expression [-Wsign-compare]
27 juil. 12:30:53 akmodsbuild: int len = nl ? nl - buf : strlen(buf);
27 juil. 12:30:53 akmodsbuild: ^
27 juil. 12:30:53 akmodsbuild: cc -Wp,-MD,/tmp/akmodsbuild.ONiVGc0h/BUILD/nvidia-304xx-kmod-304.88/_kmod_build_3.10.3-300.fc19.i686.PAE/kernel/.nv-i2c.o.d  -nostdinc -isystem /usr/lib/gcc/i686-redhat-linux/4.8.1/include -I/usr/src/kernels/3.10.3-300.fc19.i686.PAE/arch/x86/include -Iarch/x86/include/generated  -Iinclude -I/usr/src/kernels/3.10.3-300.fc19.i686.PAE/arch/x86/include/uapi -Iarch/x86/include/generated/uapi -I/usr/src/kernels/3.10.3-300.fc19.i686.PAE/include/uapi -Iinclude/generated/uapi -include /usr/src/kernels/3.10.3-300.fc19.i686.PAE/include/linux/kconfig.h -D__KERNEL__ -Wall -Wundef -Wstrict-prototypes -Wno-trigraphs -fno-strict-aliasing -fno-common -Werror-implicit-function-declaration -Wno-format-security -fno-delete-null-pointer-checks -O2 -m32 -msoft-float -mregparm=3 -freg-struct-return -fno-pic -mpreferred-stack-boundary=2 -march=i686 -mtune=generic -maccumulate-outgoing-args -Wa,-mtune=generic32 -ffreestanding -fstack-protector -DCONFIG_AS_CFI=1 -DCONFIG_AS_CFI_SIGNAL_FRAME=1 -DCONFIG_AS_CFI_SECTIONS=1 -DCONFIG_AS_AVX=1 -DCONFIG_AS_AVX2=1 -pipe -Wno-sign-compare -fno-asynchronous-unwind-tables -mno-sse -mno-mmx -mno-sse2 -mno-3dnow -mno-avx -Wframe-larger-than=1024 -Wno-unused-but-set-variable -fno-omit-frame-pointer -fno-optimize-sibling-calls -g -pg -Wdeclaration-after-statement -Wno-pointer-sign -fno-strict-overflow -fconserve-stack -DCC_HAVE_ASM_GOTO -I/tmp/akmodsbuild.ONiVGc0h/BUILD/nvidia-304xx-kmod-304.88/_kmod_build_3.10.3-300.fc19.i686.PAE/kernel -Wall -MD -Wsign-compare -Wno-cast-qual -Wno-error -D__KERNEL__ -DMODULE -DNVRM -DNV_VERSION_STRING="304.88" -Wno-unused-function -Wuninitialized -UDEBUG -U_DEBUG -DNDEBUG  -DMODULE  -D"KBUILD_STR(s)=#s" -D"KBUILD_BASENAME=KBUILD_STR(nv_i2c)"  -D"KBUILD_MODNAME=KBUILD_STR(nvidia)" -c -o /tmp/akmodsbuild.ONiVGc0h/BUILD/nvidia-304xx-kmod-304.88/_kmod_build_3.10.3-300.fc19.i686.PAE/kernel/nv-i2c.o /tmp/akmodsbuild.ONiVGc0h/BUILD/nvidia-304xx-kmod-304.88/_kmod_build_3.10.3-300.fc19.i686.PAE/kernel/nv-i2c.c
27 juil. 12:30:53 akmodsbuild: In file included from /usr/src/kernels/3.10.3-300.fc19.i686.PAE/arch/x86/include/asm/bitops.h:514:0,
27 juil. 12:30:53 akmodsbuild: from include/linux/bitops.h:22,
27 juil. 12:30:53 akmodsbuild: from include/linux/kernel.h:10,
27 juil. 12:30:53 akmodsbuild: from include/linux/sched.h:15,
27 juil. 12:30:53 akmodsbuild: from include/linux/utsname.h:5,
27 juil. 12:30:53 akmodsbuild: from /tmp/akmodsbuild.ONiVGc0h/BUILD/nvidia-304xx-kmod-304.88/_kmod_build_3.10.3-300.fc19.i686.PAE/kernel/nv-linux.h:40,
27 juil. 12:30:53 akmodsbuild: from /tmp/akmodsbuild.ONiVGc0h/BUILD/nvidia-304xx-kmod-304.88/_kmod_build_3.10.3-300.fc19.i686.PAE/kernel/nv-i2c.c:15:
27 juil. 12:30:53 akmodsbuild: include/linux/bitops.h: In function 'hweight_long':
27 juil. 12:30:53 akmodsbuild: include/asm-generic/bitops/const_hweight.h:26:70: warning: signed and unsigned type in conditional expression [-Wsign-compare]
27 juil. 12:30:53 akmodsbuild: #define hweight32(w) (__builtin_constant_p(w) ? __const_hweight32(w) : __arch_hweight32(w))
27 juil. 12:30:53 akmodsbuild: ^
27 juil. 12:30:53 akmodsbuild: include/linux/bitops.h:66:26: note: in expansion of macro 'hweight32'
27 juil. 12:30:53 akmodsbuild: return sizeof(w) == 4 ? hweight32(w) : hweight64(w);
27 juil. 12:30:53 akmodsbuild: ^
27 juil. 12:30:53 akmodsbuild: In file included from /usr/src/kernels/3.10.3-300.fc19.i686.PAE/arch/x86/include/asm/cpumask.h:4:0,
27 juil. 12:30:53 akmodsbuild: from /usr/src/kernels/3.10.3-300.fc19.i686.PAE/arch/x86/include/asm/msr.h:10,
27 juil. 12:30:53 akmodsbuild: from /usr/src/kernels/3.10.3-300.fc19.i686.PAE/arch/x86/include/asm/processor.h:20,
27 juil. 12:30:53 akmodsbuild: from /usr/src/kernels/3.10.3-300.fc19.i686.PAE/arch/x86/include/asm/thread_info.h:22,
27 juil. 12:30:53 akmodsbuild: from include/linux/thread_info.h:54,
27 juil. 12:30:53 akmodsbuild: from include/linux/preempt.h:9,
27 juil. 12:30:53 akmodsbuild: from include/linux/spinlock.h:50,
27 juil. 12:30:53 akmodsbuild: from include/linux/seqlock.h:29,
27 juil. 12:30:53 akmodsbuild: from include/linux/time.h:5,
27 juil. 12:30:53 akmodsbuild: from include/uapi/linux/timex.h:56,
27 juil. 12:30:53 akmodsbuild: from include/linux/timex.h:56,
27 juil. 12:30:53 akmodsbuild: from include/linux/sched.h:17,
27 juil. 12:30:53 akmodsbuild: from include/linux/utsname.h:5,
27 juil. 12:30:53 akmodsbuild: from /tmp/akmodsbuild.ONiVGc0h/BUILD/nvidia-304xx-kmod-304.88/_kmod_build_3.10.3-300.fc19.i686.PAE/kernel/nv-linux.h:40,
27 juil. 12:30:53 akmodsbuild: from /tmp/akmodsbuild.ONiVGc0h/BUILD/nvidia-304xx-kmod-304.88/_kmod_build_3.10.3-300.fc19.i686.PAE/kernel/nv-i2c.c:15:
27 juil. 12:30:53 akmodsbuild: include/linux/cpumask.h: In function 'cpumask_parse':
27 juil. 12:30:53 akmodsbuild: include/linux/cpumask.h:603:26: warning: signed and unsigned type in conditional expression [-Wsign-compare]
27 juil. 12:30:53 akmodsbuild: int len = nl ? nl - buf : strlen(buf);
27 juil. 12:30:53 akmodsbuild: ^
27 juil. 12:30:53 akmodsbuild: In file included from include/uapi/linux/stddef.h:1:0,
27 juil. 12:30:53 akmodsbuild: from include/linux/stddef.h:4,
27 juil. 12:30:53 akmodsbuild: from /usr/src/kernels/3.10.3-300.fc19.i686.PAE/include/uapi/linux/posix_types.h:4,
27 juil. 12:30:53 akmodsbuild: from include/uapi/linux/types.h:13,
27 juil. 12:30:53 akmodsbuild: from include/linux/types.h:5,
27 juil. 12:30:53 akmodsbuild: from include/uapi/linux/capability.h:16,
27 juil. 12:30:53 akmodsbuild: from include/linux/capability.h:15,
27 juil. 12:30:53 akmodsbuild: from include/linux/sched.h:13,
27 juil. 12:30:53 akmodsbuild: from include/linux/utsname.h:5,
27 juil. 12:30:53 akmodsbuild: from /tmp/akmodsbuild.ONiVGc0h/BUILD/nvidia-304xx-kmod-304.88/_kmod_build_3.10.3-300.fc19.i686.PAE/kernel/nv-linux.h:40,
27 juil. 12:30:53 akmodsbuild: from /tmp/akmodsbuild.ONiVGc0h/BUILD/nvidia-304xx-kmod-304.88/_kmod_build_3.10.3-300.fc19.i686.PAE/kernel/nv-gvi.c:15:
27 juil. 12:30:53 akmodsbuild: /usr/src/kernels/3.10.3-300.fc19.i686.PAE/arch/x86/include/asm/uaccess_32.h: In function 'copy_from_user':
27 juil. 12:30:53 akmodsbuild: /usr/src/kernels/3.10.3-300.fc19.i686.PAE/arch/x86/include/asm/uaccess_32.h:208:28: warning: comparison between signed and unsigned integer expressions [-Wsign-compare]
27 juil. 12:30:53 akmodsbuild: if (likely(sz == -1 || sz >= n))
27 juil. 12:30:53 akmodsbuild: ^
27 juil. 12:30:53 akmodsbuild: include/linux/compiler.h:152:40: note: in definition of macro 'likely'
27 juil. 12:30:53 akmodsbuild: # define likely(x) __builtin_expect(!!(x), 1)
27 juil. 12:30:53 akmodsbuild: ^
27 juil. 12:30:53 akmodsbuild: In file included from include/uapi/linux/stddef.h:1:0,
27 juil. 12:30:53 akmodsbuild: from include/linux/stddef.h:4,
27 juil. 12:30:53 akmodsbuild: from /usr/src/kernels/3.10.3-300.fc19.i686.PAE/include/uapi/linux/posix_types.h:4,
27 juil. 12:30:53 akmodsbuild: from include/uapi/linux/types.h:13,
27 juil. 12:30:53 akmodsbuild: from include/linux/types.h:5,
27 juil. 12:30:53 akmodsbuild: from include/uapi/linux/capability.h:16,
27 juil. 12:30:53 akmodsbuild: from include/linux/capability.h:15,
27 juil. 12:30:53 akmodsbuild: from include/linux/sched.h:13,
27 juil. 12:30:53 akmodsbuild: from include/linux/utsname.h:5,
27 juil. 12:30:53 akmodsbuild: from /tmp/akmodsbuild.ONiVGc0h/BUILD/nvidia-304xx-kmod-304.88/_kmod_build_3.10.3-300.fc19.i686.PAE/kernel/nv-linux.h:40,
27 juil. 12:30:53 akmodsbuild: from /tmp/akmodsbuild.ONiVGc0h/BUILD/nvidia-304xx-kmod-304.88/_kmod_build_3.10.3-300.fc19.i686.PAE/kernel/nv-i2c.c:15:
27 juil. 12:30:53 akmodsbuild: /usr/src/kernels/3.10.3-300.fc19.i686.PAE/arch/x86/include/asm/uaccess_32.h: In function 'copy_from_user':
27 juil. 12:30:53 akmodsbuild: /usr/src/kernels/3.10.3-300.fc19.i686.PAE/arch/x86/include/asm/uaccess_32.h:208:28: warning: comparison between signed and unsigned integer expressions [-Wsign-compare]
27 juil. 12:30:53 akmodsbuild: if (likely(sz == -1 || sz >= n))
27 juil. 12:30:53 akmodsbuild: ^
27 juil. 12:30:53 akmodsbuild: include/linux/compiler.h:152:40: note: in definition of macro 'likely'
27 juil. 12:30:53 akmodsbuild: # define likely(x) __builtin_expect(!!(x), 1)
27 juil. 12:30:53 akmodsbuild: ^
27 juil. 12:30:53 akmodsbuild: /tmp/akmodsbuild.ONiVGc0h/BUILD/nvidia-304xx-kmod-304.88/_kmod_build_3.10.3-300.fc19.i686.PAE/kernel/nv-i2c.c: In function 'nv_i2c_del_adapter':
27 juil. 12:30:53 akmodsbuild: /tmp/akmodsbuild.ONiVGc0h/BUILD/nvidia-304xx-kmod-304.88/_kmod_build_3.10.3-300.fc19.i686.PAE/kernel/nv-i2c.c:327:14: error: void value not ignored as it ought to be
27 juil. 12:30:53 akmodsbuild: osstatus = i2c_del_adapter(pI2cAdapter);
27 juil. 12:30:53 akmodsbuild: ^
27 juil. 12:30:53 akmodsbuild: make[3]: *** [/tmp/akmodsbuild.ONiVGc0h/BUILD/nvidia-304xx-kmod-304.88/_kmod_build_3.10.3-300.fc19.i686.PAE/kernel/nv-i2c.o] Error 1
27 juil. 12:30:53 akmodsbuild: make[3]: *** Waiting for unfinished jobs....
27 juil. 12:30:53 akmodsbuild: if [ "-pg" = "-pg" ]; then if [ /tmp/akmodsbuild.ONiVGc0h/BUILD/nvidia-304xx-kmod-304.88/_kmod_build_3.10.3-300.fc19.i686.PAE/kernel/nv-gvi.o != "scripts/mod/empty.o" ]; then /usr/src/kernels/3.10.3-300.fc19.i686.PAE/scripts/recordmcount  "/tmp/akmodsbuild.ONiVGc0h/BUILD/nvidia-304xx-kmod-304.88/_kmod_build_3.10.3-300.fc19.i686.PAE/kernel/nv-gvi.o"; fi; fi;
27 juil. 12:30:53 akmodsbuild: make[2]: *** [_module_/tmp/akmodsbuild.ONiVGc0h/BUILD/nvidia-304xx-kmod-304.88/_kmod_build_3.10.3-300.fc19.i686.PAE/kernel] Error 2
27 juil. 12:30:53 akmodsbuild: NVIDIA: left KBUILD.
27 juil. 12:30:53 akmodsbuild: nvidia.ko failed to build!
27 juil. 12:30:53 akmodsbuild: make[1]: *** [module] Error 1
27 juil. 12:30:53 akmodsbuild: make: *** [module] Error 2
27 juil. 12:30:53 akmodsbuild: erreur : Mauvais statut de sortie pour /var/tmp/rpm-tmp.wjEvLU (%build)
27 juil. 12:30:53 akmodsbuild: 
27 juil. 12:30:53 akmodsbuild: 
27 juil. 12:30:53 akmodsbuild: Erreur de construction de RPM :
27 juil. 12:30:53 akmodsbuild: utilisateur mockbuild inexistant - utilisation de root
27 juil. 12:30:53 akmodsbuild: groupe mockbuild inexistant - utilisation de root
27 juil. 12:30:53 akmodsbuild: utilisateur mockbuild inexistant - utilisation de root
27 juil. 12:30:53 akmodsbuild: groupe mockbuild inexistant - utilisation de root
27 juil. 12:30:53 akmodsbuild: utilisateur mockbuild inexistant - utilisation de root
27 juil. 12:30:53 akmodsbuild: groupe mockbuild inexistant - utilisation de root
27 juil. 12:30:53 akmodsbuild: date incorrecte dans %changelog : Wed Jun 18 2010 Vallimar de Morieve <vallimar@gmail.com> - 1:256.35-1
27 juil. 12:30:53 akmodsbuild: date incorrecte dans %changelog : Fri Mar  8 2008 kwizart < kwizart at gmail.com > - 171.06-1
27 juil. 12:30:53 akmodsbuild: Mauvais statut de sortie pour /var/tmp/rpm-tmp.wjEvLU (%build)
27 juil. 12:30:53 akmodsbuild: 
27 juil. 12:30:53 akmods: Building rpms failed; see /var/cache/akmods/nvidia-304xx/304.88-1.3-for-3.10.3-300.fc19.i686.PAE.failed.log for details
As tu redémarrer la machine depuis la mise à jour du kernel?
Bien sur mais je n'arrive pas à booter en level 5 avec le nouveau kernel 3.10 faute de kmod.

Quand je boote en level 3 avec ce nouveau kernel 3.10 et que j'essaie de constuire le kmod, j'obtiens l'erreur ci-dessus.
Bonjour à tous,
même chose pour moi le kernel 3.10.... ne permet pas de lancer la partie graphique.
un reboot en quiet 3 est impec mais startx plante
Sur le kernel précédent 3.9.9.... etc pas de problème tout fonctionne nickel.
En clair : ATTENDRE le prochain kernel

Pour info j'ai repris Mate Desktop, Gnome est trop gourmand en ressource.

A noter quand j'ai fait Fedup pour le passage de F18 vers F19, j'ai eu le problème qu'il ne reconnaissait plus les mots de passe, => en quiet 3 et en root, j'ai du revalider les MdP pour tous les comptes.

Compaq Presario CQ57 AMD E450 plus radeon HD6320 avec kmod katalyst
bonjour,
de mon cote c'est le wifi qui ne fonctionne pas , pas de mise à jour du kmod-wl ..
donc pour l'instant je reste en 3.9
a+
Il y a une mise à jour de l'akmod-nvidia vers la version 319.32-2.fc19.x86_64 qui résout le problème.
Installé chez moi avec le kernel 3.10 et tout fonctionne.
chepioq wrote:Il y a une mise à jour de l'akmod-nvidia vers la version 319.32-2.fc19.x86_64 qui résout le problème.
Installé chez moi avec le kernel 3.10 et tout fonctionne.
Idem pour moi, avec la mise à jour ça fonctionne....
bonjour,
idem pour moi , wifi ok.
a+