Bonjour,
Grand fan de Stepmania, je me suis dis que j'allais l'installer, j'ai donc pris les sources pour la compilation, et j'ai un petit problème :
[Matt@localhost StepMania-3.9-src]$ ./configure
.....
checking for lua_open in -llua... no
checking for lua_open in -llua50... no
checking for luaopen_base in -llualib... no
checking for luaopen_base in -llualib50... no

*** liblua is required to build StepMania; please make sure that
*** it is installed to continue the installation process.
J'ai donc cherché un peu partout ce qui permet d'avoir ceci, et j'ai trouvé que le packet lua donnait ce qui fallait, donc je l'ai installé, ce qui donne :
[Matt@localhost StepMania-3.9-src]$ ls /usr/lib/liblu*
/usr/lib/liblua-5.1.so
Mais hélas, cela ne marche toujours pas.
J'ai bien essayé avec la version 50, mais même erreur, quelqu'un aurait-il une petite idée s'il vous plait?

Merci
Helas oui 🙁
yum list lua-devel
Installed Packages
lua-devel.i386                           5.1.3-3.fc8            installed       
lua-devel.x86_64                         5.1.3-3.fc8            installed
Peux-tu poster les log. de configuration contenues dans le fichier config.log dans le répertoire des sources ?
Bien sur :
hostname = localhost.localdomain
uname -m = x86_64
uname -r = 2.6.24.5-85.fc8
uname -s = Linux
uname -v = #1 SMP Sat Apr 19 11:18:09 EDT 2008

/usr/bin/uname -p = unknown
/bin/uname -X     = unknown

/bin/arch              = x86_64
/usr/bin/arch -k       = unknown
/usr/convex/getsysinfo = unknown
hostinfo               = unknown
/bin/machine           = unknown
/usr/bin/oslevel       = unknown
/bin/universe          = unknown

PATH: /usr/kerberos/bin
PATH: /usr/lib64/ccache
PATH: /usr/local/bin
PATH: /usr/bin
PATH: /bin
PATH: /usr/X11R6/bin
PATH: /home/Matt/bin


## ----------- ##
## Core tests. ##
## ----------- ##

configure:1372: checking build system type
configure:1390: result: x86_64-unknown-linux-gnu
configure:1398: checking host system type
configure:1412: result: x86_64-unknown-linux-gnu
configure:1420: checking target system type
configure:1434: result: x86_64-unknown-linux-gnu
configure:1463: checking for a BSD-compatible install
configure:1518: result: /usr/bin/install -c
configure:1529: checking whether build environment is sane
configure:1572: result: yes
configure:1605: checking for gawk
configure:1621: found /usr/bin/gawk
configure:1631: result: gawk
configure:1641: checking whether make sets $(MAKE)
configure:1661: result: yes
configure:1827: checking whether to enable maintainer-specific portions of Makefiles
configure:1836: result: no
configure:1903: checking for gcc
configure:1919: found /usr/lib64/ccache/gcc
configure:1929: result: gcc
configure:2173: checking for C compiler version
configure:2176: gcc --version </dev/null >&5
gcc (GCC) 4.1.2 20070925 (Red Hat 4.1.2-33)
Copyright (C) 2006 Free Software Foundation, Inc.
This is free software; see the source for copying conditions.  There is NO
warranty; not even for MERCHANTABILITY or FITNESS FOR A PARTICULAR PURPOSE.

configure:2179: $? = 0
configure:2181: gcc -v </dev/null >&5
Using built-in specs.
Target: x86_64-redhat-linux
Configured with: ../configure --prefix=/usr --mandir=/usr/share/man --infodir=/usr/share/info --enable-shared --enable-threads=posix --enable-checking=release --with-system-zlib --enable-__cxa_atexit --disable-libunwind-exceptions --enable-languages=c,c++,objc,obj-c++,java,fortran,ada --enable-java-awt=gtk --disable-dssi --enable-plugin --with-java-home=/usr/lib/jvm/java-1.5.0-gcj-1.5.0.0/jre --enable-libgcj-multifile --enable-java-maintainer-mode --with-ecj-jar=/usr/share/java/eclipse-ecj.jar --with-cpu=generic --host=x86_64-redhat-linux
Thread model: posix
gcc version 4.1.2 20070925 (Red Hat 4.1.2-33)
configure:2184: $? = 0
configure:2186: gcc -V </dev/null >&5
gcc: '-V' option must have argument
configure:2189: $? = 1
configure:2212: checking for C compiler default output file name
configure:2215: gcc    conftest.c  >&5
configure:2218: $? = 0
configure:2264: result: a.out
configure:2269: checking whether the C compiler works
configure:2275: ./a.out
configure:2278: $? = 0
configure:2295: result: yes
configure:2302: checking whether we are cross compiling
configure:2304: result: no
configure:2307: checking for suffix of executables
configure:2309: gcc -o conftest    conftest.c  >&5
configure:2312: $? = 0
configure:2337: result: 
configure:2343: checking for suffix of object files
configure:2364: gcc -c   conftest.c >&5
configure:2367: $? = 0
configure:2389: result: o
configure:2393: checking whether we are using the GNU C compiler
configure:2417: gcc -c   conftest.c >&5
configure:2423: $? = 0
configure:2426: test -z              || test ! -s conftest.err
configure:2429: $? = 0
configure:2432: test -s conftest.o
configure:2435: $? = 0
configure:2448: result: yes
configure:2454: checking whether gcc accepts -g
configure:2475: gcc -c -g  conftest.c >&5
configure:2481: $? = 0
configure:2484: test -z              || test ! -s conftest.err
configure:2487: $? = 0
configure:2490: test -s conftest.o
configure:2493: $? = 0
configure:2504: result: yes
configure:2521: checking for gcc option to accept ANSI C
configure:2591: gcc  -c -g -O2  conftest.c >&5
configure:2597: $? = 0
configure:2600: test -z              || test ! -s conftest.err
configure:2603: $? = 0
configure:2606: test -s conftest.o
configure:2609: $? = 0
configure:2627: result: none needed
configure:2645: gcc -c -g -O2  conftest.c >&5
conftest.c:2: error: expected '=', ',', ';', 'asm' or '__attribute__' before 'me'
configure:2651: $? = 1
configure: failed program was:
| #ifndef __cplusplus
|   choke me
| #endif
configure:2792: checking for style of include used by make
configure:2820: result: GNU
configure:2848: checking dependency style of gcc
configure:2931: result: gcc3
configure:3000: checking for g++
configure:3016: found /usr/lib64/ccache/g++
configure:3026: result: g++
configure:3042: checking for C++ compiler version
configure:3045: g++ --version </dev/null >&5
g++ (GCC) 4.1.2 20070925 (Red Hat 4.1.2-33)
Copyright (C) 2006 Free Software Foundation, Inc.
This is free software; see the source for copying conditions.  There is NO
warranty; not even for MERCHANTABILITY or FITNESS FOR A PARTICULAR PURPOSE.

configure:3048: $? = 0
configure:3050: g++ -v </dev/null >&5
Using built-in specs.
Target: x86_64-redhat-linux
Configured with: ../configure --prefix=/usr --mandir=/usr/share/man --infodir=/usr/share/info --enable-shared --enable-threads=posix --enable-checking=release --with-system-zlib --enable-__cxa_atexit --disable-libunwind-exceptions --enable-languages=c,c++,objc,obj-c++,java,fortran,ada --enable-java-awt=gtk --disable-dssi --enable-plugin --with-java-home=/usr/lib/jvm/java-1.5.0-gcj-1.5.0.0/jre --enable-libgcj-multifile --enable-java-maintainer-mode --with-ecj-jar=/usr/share/java/eclipse-ecj.jar --with-cpu=generic --host=x86_64-redhat-linux
Thread model: posix
gcc version 4.1.2 20070925 (Red Hat 4.1.2-33)
configure:3053: $? = 0
configure:3055: g++ -V </dev/null >&5
g++: '-V' option must have argument
configure:3058: $? = 1
configure:3061: checking whether we are using the GNU C++ compiler
configure:3085: g++ -c   conftest.cc >&5
configure:3091: $? = 0
configure:3094: test -z              || test ! -s conftest.err
configure:3097: $? = 0
configure:3100: test -s conftest.o
configure:3103: $? = 0
configure:3116: result: yes
configure:3122: checking whether g++ accepts -g
configure:3143: g++ -c -g  conftest.cc >&5
configure:3149: $? = 0
configure:3152: test -z              || test ! -s conftest.err
configure:3155: $? = 0
configure:3158: test -s conftest.o
configure:3161: $? = 0
configure:3172: result: yes
configure:3214: g++ -c -g -O2  conftest.cc >&5
configure:3220: $? = 0
configure:3223: test -z              || test ! -s conftest.err
configure:3226: $? = 0
configure:3229: test -s conftest.o
configure:3232: $? = 0
configure:3258: g++ -c -g -O2  conftest.cc >&5
conftest.cc: In function 'int main()':
conftest.cc:15: error: 'exit' was not declared in this scope
configure:3264: $? = 1
configure: failed program was:
| /* confdefs.h.  */
| 
| #define PACKAGE_NAME ""
| #define PACKAGE_TARNAME ""
| #define PACKAGE_VERSION ""
| #define PACKAGE_STRING ""
| #define PACKAGE_BUGREPORT ""
| #define PACKAGE "StepMania"
| #define VERSION "3.001"
| /* end confdefs.h.  */
| 
| int
| main ()
| {
| exit (42);
|   ;
|   return 0;
| }
configure:3214: g++ -c -g -O2  conftest.cc >&5
configure:3220: $? = 0
configure:3223: test -z              || test ! -s conftest.err
configure:3226: $? = 0
configure:3229: test -s conftest.o
configure:3232: $? = 0
configure:3258: g++ -c -g -O2  conftest.cc >&5
configure:3264: $? = 0
configure:3267: test -z              || test ! -s conftest.err
configure:3270: $? = 0
configure:3273: test -s conftest.o
configure:3276: $? = 0
configure:3301: checking dependency style of g++
configure:3384: result: gcc3
configure:3442: checking for ranlib
configure:3458: found /usr/bin/ranlib
configure:3469: result: ranlib
configure:3605: checking whether byte ordering is bigendian
configure:3632: gcc -c -Wall -W -Wno-unused -Wno-switch -O3  conftest.c >&5
configure:3638: $? = 0
configure:3641: test -z              || test ! -s conftest.err
configure:3644: $? = 0
configure:3647: test -s conftest.o
configure:3650: $? = 0
configure:3674: gcc -c -Wall -W -Wno-unused -Wno-switch -O3  conftest.c >&5
conftest.c: In function 'main':
conftest.c:24: error: 'not' undeclared (first use in this function)
conftest.c:24: error: (Each undeclared identifier is reported only once
conftest.c:24: error: for each function it appears in.)
conftest.c:24: error: expected ';' before 'big'
configure:3680: $? = 1
configure: failed program was:
| /* confdefs.h.  */
| 
| #define PACKAGE_NAME ""
| #define PACKAGE_TARNAME ""
| #define PACKAGE_VERSION ""
| #define PACKAGE_STRING ""
| #define PACKAGE_BUGREPORT ""
| #define PACKAGE "StepMania"
| #define VERSION "3.001"
| #ifdef __cplusplus
| extern "C" void std::exit (int) throw (); using std::exit;
| #endif
| #define LINUX 1
| #define UNIX 1
| #define CPU_X86_64 1
| /* end confdefs.h.  */
| #include <sys/types.h>
| #include <sys/param.h>
| 
| int
| main ()
| {
| #if BYTE_ORDER != BIG_ENDIAN
|  not big endian
| #endif
| 
|   ;
|   return 0;
| }
configure:3813: result: no
configure:3854: checking how to run the C preprocessor
configure:3889: gcc -E  conftest.c
configure:3895: $? = 0
configure:3927: gcc -E  conftest.c
conftest.c:18:28: error: ac_nonexistent.h: No such file or directory
configure:3933: $? = 1
configure: failed program was:
| /* confdefs.h.  */
| 
| #define PACKAGE_NAME ""
| #define PACKAGE_TARNAME ""
| #define PACKAGE_VERSION ""
| #define PACKAGE_STRING ""
| #define PACKAGE_BUGREPORT ""
| #define PACKAGE "StepMania"
| #define VERSION "3.001"
| #ifdef __cplusplus
| extern "C" void std::exit (int) throw (); using std::exit;
| #endif
| #define LINUX 1
| #define UNIX 1
| #define CPU_X86_64 1
| #define ENDIAN_LITTLE 1
| /* end confdefs.h.  */
| #include <ac_nonexistent.h>
configure:3972: result: gcc -E
configure:3996: gcc -E  conftest.c
configure:4002: $? = 0
configure:4034: gcc -E  conftest.c
conftest.c:18:28: error: ac_nonexistent.h: No such file or directory
configure:4040: $? = 1
configure: failed program was:
| /* confdefs.h.  */
| 
| #define PACKAGE_NAME ""
| #define PACKAGE_TARNAME ""
| #define PACKAGE_VERSION ""
| #define PACKAGE_STRING ""
| #define PACKAGE_BUGREPORT ""
| #define PACKAGE "StepMania"
| #define VERSION "3.001"
| #ifdef __cplusplus
| extern "C" void std::exit (int) throw (); using std::exit;
| #endif
| #define LINUX 1
| #define UNIX 1
| #define CPU_X86_64 1
| #define ENDIAN_LITTLE 1
| /* end confdefs.h.  */
| #include <ac_nonexistent.h>
configure:4085: checking for X
configure:4191: gcc -E  conftest.c
configure:4197: $? = 0
configure:4319: result: libraries /usr/lib64, headers in standard search path
configure:4390: checking for XTestQueryExtension in -lXtst
configure:4420: gcc -o conftest -Wall -W -Wno-unused -Wno-switch -O3   conftest.c -lXtst -L/usr/lib64 -lX11  >&5
configure:4426: $? = 0
configure:4429: test -z              || test ! -s conftest.err
configure:4432: $? = 0
configure:4435: test -s conftest
configure:4438: $? = 0
configure:4451: result: yes
configure:4468: checking for glPushMatrix in -lGL
configure:4498: gcc -o conftest -Wall -W -Wno-unused -Wno-switch -O3   conftest.c -lGL -L/usr/lib64 -lX11 -lXtst  >&5
configure:4504: $? = 0
configure:4507: test -z              || test ! -s conftest.err
configure:4510: $? = 0
configure:4513: test -s conftest
configure:4516: $? = 0
configure:4529: result: yes
configure:4539: checking for gluGetString in -lGLU
configure:4569: gcc -o conftest -Wall -W -Wno-unused -Wno-switch -O3   conftest.c -lGLU -L/usr/lib64 -lX11 -lXtst -lGL  >&5
configure:4575: $? = 0
configure:4578: test -z              || test ! -s conftest.err
configure:4581: $? = 0
configure:4584: test -s conftest
configure:4587: $? = 0
configure:4600: result: yes
configure:4655: checking for sdl-config
configure:4673: found /usr/bin/sdl-config
configure:4686: result: /usr/bin/sdl-config
configure:4694: checking for SDL - version >= 1.2.6
configure:4784: gcc -o conftest -Wall -W -Wno-unused -Wno-switch -O3 -I/usr/include/SDL -D_GNU_SOURCE=1 -D_REENTRANT   conftest.c  -lSDL -lpthread >&5
configure:4787: $? = 0
configure:4789: ./conftest
configure:4792: $? = 0
configure:4810: result: yes
configure:4935: checking for png_create_read_struct in -lpng
configure:4965: gcc -o conftest -Wall -W -Wno-unused -Wno-switch -O3   conftest.c -lpng -lz -lm  >&5
configure:4971: $? = 0
configure:4974: test -z              || test ! -s conftest.err
configure:4977: $? = 0
configure:4980: test -s conftest
configure:4983: $? = 0
configure:4996: result: yes
configure:5004: checking for egrep
configure:5014: result: grep -E
configure:5019: checking for ANSI C header files
configure:5044: gcc -c -Wall -W -Wno-unused -Wno-switch -O3  conftest.c >&5
configure:5050: $? = 0
configure:5053: test -z              || test ! -s conftest.err
configure:5056: $? = 0
configure:5059: test -s conftest.o
configure:5062: $? = 0
configure:5151: gcc -o conftest -Wall -W -Wno-unused -Wno-switch -O3   conftest.c  >&5
conftest.c: In function 'main':
conftest.c:37: warning: implicit declaration of function 'exit'
conftest.c:37: warning: incompatible implicit declaration of built-in function 'exit'
configure:5154: $? = 0
configure:5156: ./conftest
configure:5159: $? = 0
configure:5174: result: yes
configure:5198: checking for sys/types.h
configure:5214: gcc -c -Wall -W -Wno-unused -Wno-switch -O3  conftest.c >&5
configure:5220: $? = 0
configure:5223: test -z              || test ! -s conftest.err
configure:5226: $? = 0
configure:5229: test -s conftest.o
configure:5232: $? = 0
configure:5243: result: yes
configure:5198: checking for sys/stat.h
configure:5214: gcc -c -Wall -W -Wno-unused -Wno-switch -O3  conftest.c >&5
configure:5220: $? = 0
configure:5223: test -z              || test ! -s conftest.err
configure:5226: $? = 0
configure:5229: test -s conftest.o
configure:5232: $? = 0
configure:5243: result: yes
configure:5198: checking for stdlib.h
configure:5214: gcc -c -Wall -W -Wno-unused -Wno-switch -O3  conftest.c >&5
configure:5220: $? = 0
configure:5223: test -z              || test ! -s conftest.err
configure:5226: $? = 0
configure:5229: test -s conftest.o
configure:5232: $? = 0
configure:5243: result: yes
configure:5198: checking for string.h
configure:5214: gcc -c -Wall -W -Wno-unused -Wno-switch -O3  conftest.c >&5
configure:5220: $? = 0
configure:5223: test -z              || test ! -s conftest.err
configure:5226: $? = 0
configure:5229: test -s conftest.o
configure:5232: $? = 0
configure:5243: result: yes
configure:5198: checking for memory.h
configure:5214: gcc -c -Wall -W -Wno-unused -Wno-switch -O3  conftest.c >&5
configure:5220: $? = 0
configure:5223: test -z              || test ! -s conftest.err
configure:5226: $? = 0
configure:5229: test -s conftest.o
configure:5232: $? = 0
configure:5243: result: yes
configure:5198: checking for strings.h
configure:5214: gcc -c -Wall -W -Wno-unused -Wno-switch -O3  conftest.c >&5
configure:5220: $? = 0
configure:5223: test -z              || test ! -s conftest.err
configure:5226: $? = 0
configure:5229: test -s conftest.o
configure:5232: $? = 0
configure:5243: result: yes
configure:5198: checking for inttypes.h
configure:5214: gcc -c -Wall -W -Wno-unused -Wno-switch -O3  conftest.c >&5
configure:5220: $? = 0
configure:5223: test -z              || test ! -s conftest.err
configure:5226: $? = 0
configure:5229: test -s conftest.o
configure:5232: $? = 0
configure:5243: result: yes
configure:5198: checking for stdint.h
configure:5214: gcc -c -Wall -W -Wno-unused -Wno-switch -O3  conftest.c >&5
configure:5220: $? = 0
configure:5223: test -z              || test ! -s conftest.err
configure:5226: $? = 0
configure:5229: test -s conftest.o
configure:5232: $? = 0
configure:5243: result: yes
configure:5198: checking for unistd.h
configure:5214: gcc -c -Wall -W -Wno-unused -Wno-switch -O3  conftest.c >&5
configure:5220: $? = 0
configure:5223: test -z              || test ! -s conftest.err
configure:5226: $? = 0
configure:5229: test -s conftest.o
configure:5232: $? = 0
configure:5243: result: yes
configure:5265: checking png.h usability
configure:5277: gcc -c -Wall -W -Wno-unused -Wno-switch -O3  conftest.c >&5
configure:5283: $? = 0
configure:5286: test -z              || test ! -s conftest.err
configure:5289: $? = 0
configure:5292: test -s conftest.o
configure:5295: $? = 0
configure:5305: result: yes
configure:5309: checking png.h presence
configure:5319: gcc -E  conftest.c
configure:5325: $? = 0
configure:5345: result: yes
configure:5380: checking for png.h
configure:5387: result: yes
configure:5417: checking for jpeg_read_scanlines in -ljpeg
configure:5447: gcc -o conftest -Wall -W -Wno-unused -Wno-switch -O3   conftest.c -ljpeg   -lpng -lz -lm >&5
configure:5453: $? = 0
configure:5456: test -z              || test ! -s conftest.err
configure:5459: $? = 0
configure:5462: test -s conftest
configure:5465: $? = 0
configure:5478: result: yes
configure:5496: checking jpeglib.h usability
configure:5508: gcc -c -Wall -W -Wno-unused -Wno-switch -O3  conftest.c >&5
configure:5514: $? = 0
configure:5517: test -z              || test ! -s conftest.err
configure:5520: $? = 0
configure:5523: test -s conftest.o
configure:5526: $? = 0
configure:5536: result: yes
configure:5540: checking jpeglib.h presence
configure:5550: gcc -E  conftest.c
configure:5556: $? = 0
configure:5576: result: yes
configure:5611: checking for jpeglib.h
configure:5618: result: yes
configure:5684: checking for lua-config50
configure:5713: result: no
configure:5684: checking for lua-config
configure:5713: result: no
configure:5726: checking for lua_open in -llua
configure:5756: gcc -o conftest -Wall -W -Wno-unused -Wno-switch -O3   conftest.c -llua   -lpng -lz -lm -ljpeg >&5
/tmp/ccIcecNz.o: In function `main':
conftest.c:(.text+0x7): undefined reference to `lua_open'
collect2: ld returned 1 exit status
configure:5762: $? = 1
configure: failed program was:
| /* confdefs.h.  */
| 
| #define PACKAGE_NAME ""
| #define PACKAGE_TARNAME ""
| #define PACKAGE_VERSION ""
| #define PACKAGE_STRING ""
| #define PACKAGE_BUGREPORT ""
| #define PACKAGE "StepMania"
| #define VERSION "3.001"
| #ifdef __cplusplus
| extern "C" void std::exit (int) throw (); using std::exit;
| #endif
| #define LINUX 1
| #define UNIX 1
| #define CPU_X86_64 1
| #define ENDIAN_LITTLE 1
| #define HAVE_LIBXTST 1
| #define HAVE_SDL 1
| #define STDC_HEADERS 1
| #define HAVE_SYS_TYPES_H 1
| #define HAVE_SYS_STAT_H 1
| #define HAVE_STDLIB_H 1
| #define HAVE_STRING_H 1
| #define HAVE_MEMORY_H 1
| #define HAVE_STRINGS_H 1
| #define HAVE_INTTYPES_H 1
| #define HAVE_STDINT_H 1
| #define HAVE_UNISTD_H 1
| /* end confdefs.h.  */
| 
| /* Override any gcc2 internal prototype to avoid an error.  */
| #ifdef __cplusplus
| extern "C"
| #endif
| /* We use char because int might match the return type of a gcc2
|    builtin and then its argument prototype would still apply.  */
| char lua_open ();
| int
| main ()
| {
| lua_open ();
|   ;
|   return 0;
| }
configure:5787: result: no
configure:5795: checking for lua_open in -llua50
configure:5825: gcc -o conftest -Wall -W -Wno-unused -Wno-switch -O3   conftest.c -llua50   -lpng -lz -lm -ljpeg >&5
/usr/bin/ld: cannot find -llua50
collect2: ld returned 1 exit status
configure:5831: $? = 1
configure: failed program was:
| /* confdefs.h.  */
| 
| #define PACKAGE_NAME ""
| #define PACKAGE_TARNAME ""
| #define PACKAGE_VERSION ""
| #define PACKAGE_STRING ""
| #define PACKAGE_BUGREPORT ""
| #define PACKAGE "StepMania"
| #define VERSION "3.001"
| #ifdef __cplusplus
| extern "C" void std::exit (int) throw (); using std::exit;
| #endif
| #define LINUX 1
| #define UNIX 1
| #define CPU_X86_64 1
| #define ENDIAN_LITTLE 1
| #define HAVE_LIBXTST 1
| #define HAVE_SDL 1
| #define STDC_HEADERS 1
| #define HAVE_SYS_TYPES_H 1
| #define HAVE_SYS_STAT_H 1
| #define HAVE_STDLIB_H 1
| #define HAVE_STRING_H 1
| #define HAVE_MEMORY_H 1
| #define HAVE_STRINGS_H 1
| #define HAVE_INTTYPES_H 1
| #define HAVE_STDINT_H 1
| #define HAVE_UNISTD_H 1
| /* end confdefs.h.  */
| 
| /* Override any gcc2 internal prototype to avoid an error.  */
| #ifdef __cplusplus
| extern "C"
| #endif
| /* We use char because int might match the return type of a gcc2
|    builtin and then its argument prototype would still apply.  */
| char lua_open ();
| int
| main ()
| {
| lua_open ();
|   ;
|   return 0;
| }
configure:5856: result: no
configure:5864: checking for luaopen_base in -llualib
configure:5894: gcc -o conftest -Wall -W -Wno-unused -Wno-switch -O3   conftest.c -llualib  -ldl  -lpng -lz -lm -ljpeg >&5
/usr/bin/ld: cannot find -llualib
collect2: ld returned 1 exit status
configure:5900: $? = 1
configure: failed program was:
| /* confdefs.h.  */
| 
| #define PACKAGE_NAME ""
| #define PACKAGE_TARNAME ""
| #define PACKAGE_VERSION ""
| #define PACKAGE_STRING ""
| #define PACKAGE_BUGREPORT ""
| #define PACKAGE "StepMania"
| #define VERSION "3.001"
| #ifdef __cplusplus
| extern "C" void std::exit (int) throw (); using std::exit;
| #endif
| #define LINUX 1
| #define UNIX 1
| #define CPU_X86_64 1
| #define ENDIAN_LITTLE 1
| #define HAVE_LIBXTST 1
| #define HAVE_SDL 1
| #define STDC_HEADERS 1
| #define HAVE_SYS_TYPES_H 1
| #define HAVE_SYS_STAT_H 1
| #define HAVE_STDLIB_H 1
| #define HAVE_STRING_H 1
| #define HAVE_MEMORY_H 1
| #define HAVE_STRINGS_H 1
| #define HAVE_INTTYPES_H 1
| #define HAVE_STDINT_H 1
| #define HAVE_UNISTD_H 1
| /* end confdefs.h.  */
| 
| /* Override any gcc2 internal prototype to avoid an error.  */
| #ifdef __cplusplus
| extern "C"
| #endif
| /* We use char because int might match the return type of a gcc2
|    builtin and then its argument prototype would still apply.  */
| char luaopen_base ();
| int
| main ()
| {
| luaopen_base ();
|   ;
|   return 0;
| }
configure:5925: result: no
configure:5933: checking for luaopen_base in -llualib50
configure:5963: gcc -o conftest -Wall -W -Wno-unused -Wno-switch -O3   conftest.c -llualib50  -ldl  -lpng -lz -lm -ljpeg >&5
/usr/bin/ld: cannot find -llualib50
collect2: ld returned 1 exit status
configure:5969: $? = 1
configure: failed program was:
| /* confdefs.h.  */
| 
| #define PACKAGE_NAME ""
| #define PACKAGE_TARNAME ""
| #define PACKAGE_VERSION ""
| #define PACKAGE_STRING ""
| #define PACKAGE_BUGREPORT ""
| #define PACKAGE "StepMania"
| #define VERSION "3.001"
| #ifdef __cplusplus
| extern "C" void std::exit (int) throw (); using std::exit;
| #endif
| #define LINUX 1
| #define UNIX 1
| #define CPU_X86_64 1
| #define ENDIAN_LITTLE 1
| #define HAVE_LIBXTST 1
| #define HAVE_SDL 1
| #define STDC_HEADERS 1
| #define HAVE_SYS_TYPES_H 1
| #define HAVE_SYS_STAT_H 1
| #define HAVE_STDLIB_H 1
| #define HAVE_STRING_H 1
| #define HAVE_MEMORY_H 1
| #define HAVE_STRINGS_H 1
| #define HAVE_INTTYPES_H 1
| #define HAVE_STDINT_H 1
| #define HAVE_UNISTD_H 1
| /* end confdefs.h.  */
| 
| /* Override any gcc2 internal prototype to avoid an error.  */
| #ifdef __cplusplus
| extern "C"
| #endif
| /* We use char because int might match the return type of a gcc2
|    builtin and then its argument prototype would still apply.  */
| char luaopen_base ();
| int
| main ()
| {
| luaopen_base ();
|   ;
|   return 0;
| }
configure:5994: result: no

## ---------------- ##
## Cache variables. ##
## ---------------- ##

ac_cv_build=x86_64-unknown-linux-gnu
ac_cv_build_alias=x86_64-unknown-linux-gnu
ac_cv_c_bigendian=no
ac_cv_c_compiler_gnu=yes
ac_cv_cxx_compiler_gnu=yes
ac_cv_env_CC_set=
ac_cv_env_CC_value=
ac_cv_env_CFLAGS_set=
ac_cv_env_CFLAGS_value=
ac_cv_env_CPPFLAGS_set=
ac_cv_env_CPPFLAGS_value=
ac_cv_env_CPP_set=
ac_cv_env_CPP_value=
ac_cv_env_CXXFLAGS_set=
ac_cv_env_CXXFLAGS_value=
ac_cv_env_CXX_set=
ac_cv_env_CXX_value=
ac_cv_env_LDFLAGS_set=
ac_cv_env_LDFLAGS_value=
ac_cv_env_build_alias_set=
ac_cv_env_build_alias_value=
ac_cv_env_host_alias_set=
ac_cv_env_host_alias_value=
ac_cv_env_target_alias_set=
ac_cv_env_target_alias_value=
ac_cv_exeext=
ac_cv_have_x='have_x=yes         ac_x_includes= ac_x_libraries=/usr/lib64'
ac_cv_header_inttypes_h=yes
ac_cv_header_jpeglib_h=yes
ac_cv_header_memory_h=yes
ac_cv_header_png_h=yes
ac_cv_header_stdc=yes
ac_cv_header_stdint_h=yes
ac_cv_header_stdlib_h=yes
ac_cv_header_string_h=yes
ac_cv_header_strings_h=yes
ac_cv_header_sys_stat_h=yes
ac_cv_header_sys_types_h=yes
ac_cv_header_unistd_h=yes
ac_cv_host=x86_64-unknown-linux-gnu
ac_cv_host_alias=x86_64-unknown-linux-gnu
ac_cv_lib_GLU_gluGetString=yes
ac_cv_lib_GL_glPushMatrix=yes
ac_cv_lib_Xtst_XTestQueryExtension=yes
ac_cv_lib_jpeg_jpeg_read_scanlines=yes
ac_cv_lib_lua50_lua_open=no
ac_cv_lib_lua_lua_open=no
ac_cv_lib_lualib50_luaopen_base=no
ac_cv_lib_lualib_luaopen_base=no
ac_cv_lib_png_png_create_read_struct=yes
ac_cv_objext=o
ac_cv_path_SDL_CONFIG=/usr/bin/sdl-config
ac_cv_path_install='/usr/bin/install -c'
ac_cv_prog_AWK=gawk
ac_cv_prog_CPP='gcc -E'
ac_cv_prog_ac_ct_CC=gcc
ac_cv_prog_ac_ct_CXX=g++
ac_cv_prog_ac_ct_RANLIB=ranlib
ac_cv_prog_cc_g=yes
ac_cv_prog_cc_stdc=
ac_cv_prog_cxx_g=yes
ac_cv_prog_egrep='grep -E'
ac_cv_prog_make_make_set=yes
ac_cv_target=x86_64-unknown-linux-gnu
ac_cv_target_alias=x86_64-unknown-linux-gnu
am_cv_CC_dependencies_compiler_type=gcc3
am_cv_CXX_dependencies_compiler_type=gcc3

## ----------------- ##
## Output variables. ##
## ----------------- ##

ACLOCAL='${SHELL} /home/Matt/Programmes/stepmania/StepMania-3.9-src/autoconf/missing --run aclocal-1.7'
ALSA_CFLAGS=''
ALSA_LIBS=''
AMDEPBACKSLASH='\'
AMDEP_FALSE='#'
AMDEP_TRUE=''
AMTAR='${SHELL} /home/Matt/Programmes/stepmania/StepMania-3.9-src/autoconf/missing --run tar'
AUDIO_LIBS=''
AUTOCONF='${SHELL} /home/Matt/Programmes/stepmania/StepMania-3.9-src/autoconf/missing --run autoconf'
AUTOHEADER='${SHELL} /home/Matt/Programmes/stepmania/StepMania-3.9-src/autoconf/missing --run autoheader'
AUTOMAKE='${SHELL} /home/Matt/Programmes/stepmania/StepMania-3.9-src/autoconf/missing --run automake-1.7'
AWK='gawk'
BUILD_TESTS_FALSE=''
BUILD_TESTS_TRUE=''
CC='gcc'
CCDEPMODE='depmode=gcc3'
CFLAGS='-Wall -W -Wno-unused -Wno-switch -O3'
CPP='gcc -E'
CPPFLAGS=''
CXX='g++'
CXXDEPMODE='depmode=gcc3'
CXXFLAGS='-Wall -W -Wno-unused -Wno-switch -O3'
CYGPATH_W='echo'
DEFS=''
DEPDIR='.deps'
ECHO_C=''
ECHO_N='-n'
ECHO_T=''
EGREP='grep -E'
EXEEXT=''
GTK_CFLAGS=''
GTK_LIBS=''
HAVE_ALSA_FALSE=''
HAVE_ALSA_TRUE=''
HAVE_FFMPEG_FALSE=''
HAVE_FFMPEG_TRUE=''
HAVE_GTK_FALSE=''
HAVE_GTK_TRUE=''
HAVE_MP3_FALSE=''
HAVE_MP3_TRUE=''
HAVE_OSS_FALSE=''
HAVE_OSS_TRUE=''
HAVE_SDL_FALSE='#'
HAVE_SDL_TRUE=''
HAVE_VORBIS_FALSE=''
HAVE_VORBIS_TRUE=''
INSTALL_DATA='${INSTALL} -m 644'
INSTALL_PROGRAM='${INSTALL}'
INSTALL_SCRIPT='${INSTALL}'
INSTALL_STRIP_PROGRAM='${SHELL} $(install_sh) -c -s'
LDFLAGS=''
LIBOBJS=''
LIBS=' -lpng -lz -lm -ljpeg'
LINUX_FALSE='#'
LINUX_TRUE=''
LTLIBOBJS=''
LUA_CFLAGS=''
LUA_CONFIG=''
LUA_LIBS=''
MAINT='#'
MAINTAINER_MODE_FALSE=''
MAINTAINER_MODE_TRUE='#'
MAKEINFO='${SHELL} /home/Matt/Programmes/stepmania/StepMania-3.9-src/autoconf/missing --run makeinfo'
OBJEXT='o'
PACKAGE='StepMania'
PACKAGE_BUGREPORT=''
PACKAGE_NAME=''
PACKAGE_STRING=''
PACKAGE_TARNAME=''
PACKAGE_VERSION=''
PATH_SEPARATOR=':'
PKG_CONFIG=''
RANLIB='ranlib'
SDL_CFLAGS='-I/usr/include/SDL -D_GNU_SOURCE=1 -D_REENTRANT'
SDL_CONFIG='/usr/bin/sdl-config'
SDL_LIBS='-lSDL -lpthread'
SET_MAKE=''
SHELL='/bin/sh'
STRIP=''
UNIX_FALSE='#'
UNIX_TRUE=''
USE_CRASH_HANDLER_FALSE=''
USE_CRASH_HANDLER_TRUE=''
VERSION='3.001'
WITHOUT_NETWORKING_FALSE=''
WITHOUT_NETWORKING_TRUE='#'
XCFLAGS=''
XLIBS='-L/usr/lib64 -lX11 -lXtst -lGL -lGLU'
ac_ct_CC='gcc'
ac_ct_CXX='g++'
ac_ct_RANLIB='ranlib'
ac_ct_STRIP=''
am__fastdepCC_FALSE='#'
am__fastdepCC_TRUE=''
am__fastdepCXX_FALSE='#'
am__fastdepCXX_TRUE=''
am__include='include'
am__leading_dot='.'
am__quote=''
bindir='${exec_prefix}/bin'
build='x86_64-unknown-linux-gnu'
build_alias=''
build_cpu='x86_64'
build_os='linux-gnu'
build_vendor='unknown'
datadir='${prefix}/share'
exec_prefix='NONE'
host='x86_64-unknown-linux-gnu'
host_alias=''
host_cpu='x86_64'
host_os='linux-gnu'
host_vendor='unknown'
includedir='${prefix}/include'
infodir='${prefix}/info'
install_sh='/home/Matt/Programmes/stepmania/StepMania-3.9-src/autoconf/install-sh'
libdir='${exec_prefix}/lib'
libexecdir='${exec_prefix}/libexec'
localstatedir='${prefix}/var'
mandir='${prefix}/man'
oldincludedir='/usr/include'
prefix='NONE'
program_transform_name='s,x,x,'
sbindir='${exec_prefix}/sbin'
sharedstatedir='${prefix}/com'
sysconfdir='${prefix}/etc'
target='x86_64-unknown-linux-gnu'
target_alias=''
target_cpu='x86_64'
target_os='linux-gnu'
target_vendor='unknown'

## ----------- ##
## confdefs.h. ##
## ----------- ##

#define CPU_X86_64 1
#define ENDIAN_LITTLE 1
#define HAVE_INTTYPES_H 1
#define HAVE_LIBXTST 1
#define HAVE_MEMORY_H 1
#define HAVE_SDL 1
#define HAVE_STDINT_H 1
#define HAVE_STDLIB_H 1
#define HAVE_STRINGS_H 1
#define HAVE_STRING_H 1
#define HAVE_SYS_STAT_H 1
#define HAVE_SYS_TYPES_H 1
#define HAVE_UNISTD_H 1
#define LINUX 1
#define PACKAGE "StepMania"
#define PACKAGE_BUGREPORT ""
#define PACKAGE_NAME ""
#define PACKAGE_STRING ""
#define PACKAGE_TARNAME ""
#define PACKAGE_VERSION ""
#define STDC_HEADERS 1
#define UNIX 1
#define VERSION "3.001"
#endif
#ifdef __cplusplus
extern "C" void std::exit (int) throw (); using std::exit;

configure: exit 0
Pas de petite idée quelqu'un? :-D
Ton configure.in doit êter modifié pour détecter la bonne version de lua. (la honte ils utilisent pas pkg-config)
En gros upstream doit être mort (ou sous debian) pour se planter à ce point.
Uhm c'est ce que je pensais, je vais devoir faire mumuse dedans, et merde :-D
je viens de jeter un coup d'oeil, ca sent le travail vite fait mal fait, bon bah aller merci kwizard et c'est parti pour la chiantise.....grrr :hammer: